32x Error Code Registry

Consolidated Etched test-harness error codes — MLT / 1X, L10, Common and L11 — with revision history and original author per code. Field names and enum values follow th_registry.yaml (TH Error Code Specification v0.3 §7, §11.1), the source of truth.

Version
v0.1 of this page and repo · document revision 0.4 · every code at version: 1
Repository
github.com/Quan-Etched/ErrorCode_Prod_Test
Published at
quan-etched.github.io/ErrorCode_Prod_Test
Source of truth
etched-ai/sw → host/system_test/error_codes sw@65cf3520a606
Slack
#error-code-define · #tiger-error-code
Owner
supercomputing-sw
386
error codes
78
MLT / 1X
228
L10
19
Common
61
L11
325
in the registries
76
test cases with DRI
Identity segments are immutable. Per th_registry.yaml: never renumber, never reuse a code — a change of meaning requires a new code. The -SxQy suffix carries severity and quick action; the stable identity is the TH-<BLOCK>-<NNNN> prefix.

Download the source workbook

Code tables below are refreshed from the registry snapshots. The spreadsheet export and its verbatim CSVs are unchanged.

FileWhat it isSize
etched_error_code.xlsxThe source workbook — a mirror of the original spreadsheet. Same tabs in the same order, same columns, same rows, nothing added or reordered. This is the file to edit and commit.47 KB
etched_error_code_annotated.xlsxThe joined view: version, original author, severity and quick-action names, owner, since, and registry status, with the code tables refreshed from the current registries.173 KB
data/source/
revision_history.csv
mlt_1x.csv
l10.csv
l11.csv
field_definitions.csv
dri_ownership.csv
suite_run_log.csv
Each source tab as CSV, verbatim — the diffable form of the workbook above.7 files
data/
revision_history.csv
mlt_1x.csv
l10.csv
common.csv
l11.csv
field_definitions.csv
error_id_encoding.csv
dri_ownership.csv
source_data_notes.csv
enum_legends.csv
Joined tabs as CSV. MLT / 1X, L10 and Common are refreshed from the registries. L11 is the previous spreadsheet draft.10 files
sheet.mdVerbatim export of the Google Sheet the earlier tables were built from.104 KB
th_registry.yaml
MLT/mlt_th_registry.yaml
L10/l10_th_registry.yaml
common_th_registry.yaml
Snapshots of host/system_test/error_codes at sw@65cf3520a606.4 files

Revision history

From the source spreadsheet, oldest revision first.

VersionCommentAuthor
0.1DraftUlysses Kao
0.2update the test case and error code for SLT 1XUlysses Kao
0.3Update the error codeUlysses Kao
0.4Refresh from host/system_test/error_codes at sw@65cf3520a606supercomputing-sw

Error code fields

FieldDescription
Error Code IDThe key ID of Error code
MessageThe possible error message
Quick_ActionHow does the user or operate handle this issues immediately
Recover_StepDetail recover steps for this error
SourceError from which test or software
Error_TypeError types
ComponentRelative components
Test_CaseJira IDs of test cases, allow multiple IDs, separate by “,”
BugsJira IDs of bugs, allow multiple IDs, separate by “,”
CountCount of happen
Last_happenDatetime of last happen

Error ID encoding (L11 EC-* space)

Character layout of the 12-hex-digit EC- identifier used by the L11 block.

Char #DescribeDefine
0Priority0~2: Priority 0~2
3~F: Reserve
1Quick action0: No act 1: Cold Reboot 2: Warm Reboot 3: Soft power off
4: Hard shutdown
5: Disable component
6: Undefined 7: Hot remove 8: Hot switch
9~F: Reserve
2~3SourceFF: Forward from out of Etched
00: MTS 01: SLT 02: 1X Test 03: L10 Test 04: L11 Test 05: Kayak 06: RMS 07: PDU Daemon 08: CDU Daemon
09: BMC 0A: BIOS
0B~FE reserve
4~5Error Type00: Undefine 01: Initial 02: Connection 03: Provision 04: Config (HW/SW/FW) 05: Unit Test 06: Function 07: Stress 08: Sensors
0A~FF: reserve
6~7Component00: Undfine 01: Soho chip 02: CPU 03: DIMM 04: PDU 05: CDU 06: RMS 07: BMC 08: BIOS 09: Storage 0A: ToR Switch
0B: Manage switch 0C: Temp 0D: Fan 0E: PSU 0F~0xFF: reserve
8~11Serial numberThe serial number of error code
From 0000~FFFF

Enum legends

Values as used by category, severity and quick_action in the registries.

Category

ValueName
0CATEGORY_NONE
1CATEGORY_NETWORK
2CATEGORY_STORAGE
3CATEGORY_MEMORY
4CATEGORY_AUTH
5CATEGORY_CONFIG
6CATEGORY_HARDWARE
7CATEGORY_SOFTWARE
8CATEGORY_API
9CATEGORY_RESOURCE
10CATEGORY_SECURITY
11CATEGORY_DATA
12CATEGORY_INTERNAL

Severity

ValueName
0ERROR_NONE
1ERROR_MONITOR
2ERROR_ISOLATE
3ERROR_UNKNOWN
4ERROR_TRIAGE
5ERROR_CONFIG
6ERROR_RESET

Quick action

ValueName
0QA_NO_ACT
1QA_COLD_REBOOT
2QA_WARM_REBOOT
3QA_SOFT_POWER_OFF
4QA_HARD_SHUTDOWN
5QA_DISABLE_COMPONENT
6QA_RETRY
7QA_HOT_REMOVE
8QA_HOT_SWITCH
9QA_ESCALATE

MLT / 1X Module Test codes

Refreshed from MLT/mlt_th_registry.yaml and 1X-only leftovers. 78 codes.

Error Code IDVerDoc RevOriginal AuthorNameMessageSeverityQuick ActionRecover / Troubleshooting ProcedureError TypeComponentTest CaseSourceBugsOwnerSince
TH-C2C-0001-S2Q9v10.2Mykola ServetnykC2C_LINKUP_FAILEDC2C lanes failed to train or link up within the timeout: RX equalization did not converge after its configured attempts, or the link-up test reported one or more datalinks/lanes down.S2 ISOLATEQ9 ESCALATECollect the suite/test logs and artifacts for this failure. Escalate to Etched engineer with the collected logs.Hardware1X.C2C.SOHU_SERDESC2cLinkupTestCase
C2cLinkupMultiChipTestCase
C2cThroughputTestCase
C2cThroughputMultiChipTestCase
1X Module TestETCH-33573: C2cLinkupTestCase Failuresupercomputing-swharness 2026.216
TH-C2C-0002-S2Q9v10.2Mykola ServetnykC2C_LOOPBACK_DATA_INTEGRITY_MISMATCHBit-by-bit C2C loopback comparison found a data mismatch on at least one datalink/lane.S2 ISOLATEQ9 ESCALATECollect the suite/test logs and artifacts for this failure. Escalate to Etched engineer with the collected logs.Data1X.C2C.SOHU_SERDESC2cIntegrityTestCase
C2cIntegrityMultiChipTestCase
1X Module TestETCH-33915: C2cIntegrityTestCase failuresupercomputing-swharness 2026.216
TH-C2C-0003-S2Q9v10.2Mykola ServetnykC2C_LOOPBACK_THROUGHPUT_BELOW_THRESHOLDThe large C2C transfer did not meet its acceptance criteria: measured throughput below the configured percentage of line rate (90% in the 1X suite), or the post-FEC uncorrected error fraction above its limit.S2 ISOLATEQ9 ESCALATECollect the suite/test logs and artifacts for this failure. Escalate to Etched engineer with the collected logs.Hardware1X.C2C.SOHU_SERDESC2cThroughputTestCase
C2cThroughputMultiChipTestCase
1X Module TestETCH-32191: C2cIntegrityTestCase/C2cThroughputTestCase Failuressupercomputing-swharness 2026.216
TH-C2C-0004-S4Q9v10.2Mykola ServetnykC2C_LANE_MARGIN_BELOW_THRESHOLDWorst per-lane minimum BER from the eye-diagram sweep exceeded the configured ber_threshold. The SERDES margin spec is not final, so this code is severity 4 (triage) rather than a straight isolate: confirm against the current spec before dispositioning a module.S4 TRIAGEQ9 ESCALATECollect the suite/test logs and artifacts for this failure. Escalate to Etched engineer with the collected logs.Hardware1X.C2C.SOHU_SERDESC2cLaneMarginTestCase1X Module Test—supercomputing-swharness 2026.216
TH-C2C-0005-S2Q9v10.3Mykola ServetnykC2C_PRBS_ERROR_THRESHOLD_EXCEEDEDThe C2C PRBS run completed but the measured pre-FEC bit-error rate exceeded max_pre_fec_ber on at least one lane.S2 ISOLATEQ9 ESCALATECollect the suite/test logs and artifacts for this failure. Escalate to Etched engineer with the collected logs.CATEGORY_DATA1X.C2C.SOHU_SERDESC2cPrbsLoopbackTestCase
C2cPrbsMultiChipTestCase
L10 Test—supercomputing-swharness 2026.216
TH-C2C-0009-S2Q9v10.4Ulysses KaoC2C_LINK_STABILITY_FAILEDA C2C lane lost lock in the stability test and went link down. This is a risk for kayak and this should be investigated.S2 ISOLATEQ9 ESCALATECollect the suite/test logs and artifacts for this failure. Escalate to Etched engineer with the collected logs.Hardware1X.C2C.SOHU_SERDESC2cLinkStabilityMultiChipTestCaseMLT / 1X Module Test—accelerator-swharness 2026.229
TH-DMA-0001-S2Q6v10.2Sam JiangDMA_DATA_PATH_FAILHost-chip DMA data-path test failure: dma_test_app reported a data verification or March C+ failure on an SRAM region (RopeSram / CentralSram), or failed in a way its output does not attribute to a more specific PCIe/HBM failure mode (fallback for this test).S2 ISOLATEQ6 RETRYSuspected test issue (single chip test timeout took down the station), retest once.Hardware1X.DMA.HOST_CHIP_PATHSohuDmaTestCase1X Module TestETCH-35873: SohuDmaTestCase failuresupercomputing-swharness 2026.216
TH-FW-0001-S2Q9v10.2Mykola ServetnykSOHU_FIRMWARE_UPDATE_FAILEDThe Sohu application firmware update did not complete: loading or executing the image package raised, the ASIC did not become pingable afterwards, or the ASIC came back without reporting application firmware. For the hot-reload case it also covers the pre-update eligibility outcomes, where nothing was flashed at all — the chip is running a legacy bootloader, is in bootloader mode with no application PLDM endpoint, or the precheck could not read the running versions over RPC/proxy.S2 ISOLATEQ9 ESCALATECollect the suite/test logs and artifacts for this failure. Escalate to Etched engineer with the collected logs.Config1X.FW.SOHU_APP_FIRMWARESohuFirmwareUpdateTestCase
SohuHotReloadFirmwareUpdateTestCase
SohuSecureBootRecoveryUpdateTestCase
1X Module TestETCH-34843: SohuHotReloadFirmwareUpdateTestCase failuresupercomputing-swharness 2026.216
TH-FW-0002-S4Q9v10.2Mykola ServetnykSOHU_FIRMWARE_IMAGE_HASH_MISMATCHThe ASIC booted application firmware after the update, but the running image hash from get_version_info() does not match the hash in the image package that was just staged.S4 TRIAGEQ9 ESCALATECollect the suite/test logs and artifacts for this failure. Escalate to Etched engineer with the collected logs.Config1X.FW.SOHU_APP_FIRMWARESohuFirmwareUpdateTestCase1X Module Test—supercomputing-swharness 2026.216
TH-FW-0003-S2Q6v10.2Aidan HolmBOOTLOADER_PROGRAMMING_FAILEDBootloader programming failed (flash program fail or no ping after program).S2 ISOLATEQ6 RETRYVerify that the green power indicators on the Sohu module are ON. Verify that both the PCIe cable and power cable are connected correctly and securely. If there is no trouble found, retest once.Hardware1X.FW.BOOTLOADERProgramSecureBootloaderTestCase
BootloaderResultTestCase
1X Module TestETCH-35585: BootloaderResultTestCase failuressupercomputing-swharness 2026.217
TH-FW-0004-S4Q6v10.2Aidan HolmJTAG_IMAGE_LOAD_VERIFY_FAILEDJTAG image load/verify failed (ICCM verify mismatch).S4 TRIAGEQ6 RETRYSuspected test issue, retest once.Hardware1X.FW.JTAGProgramSecureBootloaderTestCase
BootloaderResultTestCase
1X Module TestETCH-35586: ProgramSecureBootloaderTestCase failuresupercomputing-swharness 2026.217
TH-FW-0005-S5Q2v10.2Ulysses KaoFIXTURE_FIRMWARE_UPDATE_FAILEDFixture firmware update failed (golden VBB / retimer): OpenOCD flash, ST-Link adapter, post-flash UART/RPC ready check, or application firmware-hash verification did not succeed.S5 CONFIGQ2 WARM_REBOOTReboot Devkit, retest once.Config1X.FW.FIXTUREVbbFirmwareUpdateTestCase
RetimerFirmwareUpdateTestCase
1X Module Test—supercomputing-swharness 2026.217
TH-FW-0006-S5Q9v10.2Mykola ServetnykBOARD_DVFS_PROFILE_FAILEDBoard DVFS profile detection or application failed.S5 CONFIGQ9 ESCALATECollect the suite/test logs and artifacts for this failure. Escalate to Etched engineer with the collected logs.Config1X.FW.DVFS_PROFILEDetectBoardDvfsProfileTestCase1X Module Test—supercomputing-swharness 2026.216
TH-FW-0007-S2Q6v10.2Ulysses KaoSECURE_BOOT_RECOVERY_UPDATE_TIMEOUTThe PLDM Update Agent did not complete within pldm_update_timeout_s during a secure-boot recovery update - the device is likely not responding over the Sohu UART in recovery mode.S2 ISOLATEQ6 RETRYVerify UART cabling and that recovery straps engage; rerun once; preserve logs and route to FW triageConfigMLT.FW.SOHU_CHIPSohuSecureBootRecoveryUpdateTestCase1X Module Test—supercomputing-swharness 2026.216
TH-FW-0008-S2Q6v10.2Ulysses KaoSECURE_BOOT_RECOVERY_UPDATE_FAILThe VFIO app firmware update through secure-boot recovery mode failed - the recovery strap sequence failed or the PLDM Update Agent reported an update failure (non-zero pldm_ua exit, update rejected by the device). Tooling/deployment gaps are TH-HAR-0003; invalid args are TH-HAR-0002.S2 ISOLATEQ6 RETRYVerify UART cabling/seating and rerun recovery-update subset once; then preserve unit + pldm_ua log and verify package vs release; route to FW triage - do NOT keep retrying as device may be mid-updateConfigMLT.FW.SOHU_CHIPSohuSecureBootRecoveryUpdateTestCase1X Module Test—supercomputing-swharness 2026.216
TH-FW-0009-S5Q9v10.2James ChouSOHU_HOT_RELOAD_NOT_ELIGIBLEThe hot reload could not start, so no firmware was written: the chip is running a legacy bootloader rather than secure_bootloader, it is in bootloader mode with no application PLDM endpoint, or the precheck could not read the running versions over RPC/proxy. The suite must run secure-boot recovery or bootstrap before this test case. Distinct from TH-FW-0001, which covers an update that was attempted and failed.S5 CONFIGQ9 ESCALATEEscalate to Etched with the eligibility outcome and the running image name; nothing was flashed, so do not route the unit to rework or FA.Config1X.FW.SOHU_APP_FIRMWARESohuHotReloadFirmwareUpdateTestCase1X Module Test—supercomputing-swharness 2026.217
TH-FW-0018-S5Q9v10.3Mykola ServetnykSOHU_FIRMWARE_VERSION_MISMATCHThe running Sohu firmware is not the image the suite requires: application firmware was expected, but the chip reported only a bootloader slot. The inverse (application firmware running when the step did not expect it) is a suite sequencing problem and stays unclassified.S5 CONFIGQ9 ESCALATECollect the suite/test logs and artifacts for this failure. Escalate to Etched engineer with the collected logs.CATEGORY_CONFIG1X.FW.SOHU_APP_FIRMWARECheckFirmwareVersionTestCaseL10 Test—supercomputing-swharness 2026.226
TH-HBM-0001-S2Q9v10.2Jack ChouHBM_PMBIST_FAILUREHBM PMBIST failure.S2 ISOLATEQ9 ESCALATECollect the suite/test logs and artifacts for this failure. Escalate to Etched engineer with the collected logs.Memory1X.HBM.STACKSohuPmbistTestCase1X Module TestETCH-33885: Power Virus failures [was SohuPmbistTestCase failures]supercomputing-swharness 2026.216
TH-HBM-0003-S4Q9v10.2Jack ChouHBM_EYE_MARGIN_BELOW_THRESHOLDHBM training / eye margin below threshold (tentative).S4 TRIAGEQ9 ESCALATECollect the suite/test logs and artifacts for this failure. Escalate to Etched engineer with the collected logs.Memory1X.HBM.STACKSohuRdqsSweepTrainingTestCase1X Module Test—supercomputing-swharness 2026.216
TH-HBM-0004-S2Q6v10.2Jack ChouHBM_MTC_STRESS_FAILUREHBM MTC stress test failure.S2 ISOLATEQ6 RETRYSuspected test issue, retest once.Memory1X.HBM.STACKSohuMtcStressTestCase1X Module TestETCH-35299: SohuMtcStressTestCase failuressupercomputing-swharness 2026.216
TH-HBM-0005-S2Q9 retiredv10.2Ulysses KaoHBM_BANDWIDTH_BELOW_THRESHOLDPCIe-to-HBM read or write throughput did not reach the configured floor.S2 ISOLATEQ9 ESCALATECollect the suite/test logs and artifacts for this failure. Escalate to Etched engineer with the collected logs.Memory1X.HBM.STACK—1X Module Test—supercomputing-swharness 2026.216
TH-HBM-0006-S2Q9v10.2James ChouHBM_LANE_REPAIR_FAILEDLane repair established that one or more HBM pseudo-channels cannot be repaired within spare coverage. Covers a completed sweep with per-target errors (fail_fast=False), and fail_fast raises that prove unrepairability (exhausted candidate byte pairs, multi-bit / aword / DWORD LFSR unrepairable, or applied repairs still failing verification). Distinct from TH-HBM-0008, which covers an aborted sweep where repairability was never established (RPC / firmware / setup).S2 ISOLATEQ9 ESCALATECollect the suite/test logs and artifacts for this failure. Escalate to Etched engineer with the collected logs.Memory1X.HBM.STACKSohuLaneRepairTestCase1X Module TestETCH-35587: SohuLaneRepairTestCase failuresupercomputing-swharness 2026.216
TH-HBM-0007-S2Q9v10.2James ChouHBM_DEVICE_ID_READ_FAILThe IEEE 1500 DRAM device ID could not be read from every HBM stack, or the reported stack topology did not match the expected stack count. Covers an unreadable device ID (RPC error, timeout, or unexpected response) as well as a missing channel id or wrong number of stacks in the reported system info.S2 ISOLATEQ9 ESCALATECollect the suite/test logs and artifacts for this failure. Escalate to Etched engineer with the collected logs.Data1X.HBM.STACKSohuHbmDeviceIdTestCase1X Module Test—supercomputing-swharness 2026.216
TH-HBM-0008-S4Q9v10.2James ChouHBM_LANE_REPAIR_INCOMPLETEThe lane-repair detection sweep did not run to completion, so whether a passing repair exists was never established. Covers unexpected detection abort (RPC / TypeError / firmware reload after clearing persisted repairs) before an unrepairable verdict. Distinct from TH-HBM-0006, which covers proven unrepairability (exhausted candidates, multi-bit / aword / DWORD LFSR unrepairable, or repairs that still fail verification).S4 TRIAGEQ9 ESCALATEEscalate to Etched with the detection exception and the partial repair map; repairability is unknown rather than failed, so do not route the unit to FA.Memory1X.HBM.STACKSohuLaneRepairTestCase1X Module Test—supercomputing-swharness 2026.217
TH-HBM-0014-S5Q9v10.4Ulysses KaoHBM_NOT_TRAINED_FOR_REQUIRED_SPEEDThe chip does not carry HBM DCDL training covering every pseudo-channel of every HBM at the data rate the suite requires, or is running a different rate. Also covers a Flash init-config overlay that does not decode at all, which means no persisted training exists. Firmware refuses an untrained module its trained production point, and nothing else in the suite fails on such a chip, so without this check an untrained socket ships. The emitting case only reads the persisted records and the running speed bin; it changes nothing on the chip.S5 CONFIGQ9 ESCALATEConfirm the unit's board/chip swap history since its last HBM training run. Request an HBM training run at the required data rate for the HBMs named by the untrained bitmask, then rerun this suite. If training completes and the socket still reports untrained HBMs, escalate to Etched with the suite logs.Config1X.HBM.STACK—MLT / 1X Module Test—supercomputing-swharness 2026.245
TH-MEZZ-0001-S2Q6v10.2Aidan HolmMEZZANINE_CPLD_ACCESS_WRITE_FAILEDMezz/eval CPLD register access or write failure.S2 ISOLATEQ6 RETRYVerify that the green power indicators on the Sohu module are ON. Verify that both the PCIe cable and power cable are connected correctly and securely. If there is no trouble found, retest once.Hardware1X.MEZZ.CPLDProgramSecureBootloaderTestCase
BootloaderResultTestCase
1X Module TestETCH-35586: ProgramSecureBootloaderTestCase failuresupercomputing-swharness 2026.217
TH-MEZZ-0002-S2Q6v10.2Aidan HolmUNEXPECTED_MEZZANINE_I2C_ALERTUnexpected mezzanine I2C alert asserted.S2 ISOLATEQ6 RETRYSuspected test issue, retest once.Hardware1X.MEZZ.I2CMezzanineI2cAlertsTestCase1X Module Test—supercomputing-swharness 2026.217
TH-MEZZ-0003-S2Q6v10.4Aidan HolmEXPECTED_MEZZANINE_I2C_ALERT_NOT_OBSERVEDExpected mezzanine I2C alert was not observed.S2 ISOLATEQ6 RETRYSuspected test issue, retest once.Hardware1X.MEZZ.I2CMezzanineI2cAlertsTestCaseMLT / 1X Module Test—supercomputing-swharness 2026.219
TH-PCIE-0001-S2Q6v10.2Jack ChouPCIE_LINK_STATE_MISMATCHPCIe link state mismatch: the Sohu endpoint link is not L0 / Gen5 / x16.S2 ISOLATEQ6 RETRYSuspect PCIe cable not fully seated into PV1 board, reseat the cable and retest once.Hardware1X.PCIE.LINKSohuPcieAerCheckTestCase1X Module Test—supercomputing-swharness 2026.216
TH-PCIE-0002-S2Q6v10.2Jack ChouPCIE_AER_ERRORS_DETECTEDPCIe AER errors detected (correctable or uncorrectable).S2 ISOLATEQ6 RETRYSuspect PCIe cable not fully seated into PV1 board, reseat the cable and retest once.Hardware1X.PCIE.LINKSohuPcieAerCheckTestCase1X Module TestETCH-34150: Power Virus failures [was SohuPcieAerCheckTestCase failures]supercomputing-swharness 2026.216
TH-PCIE-0003-S2Q9v10.2Sam JiangPCIE_CSRAM_DMA_THROUGHPUT_BELOW_THRESHOLDPCIe->CSRAM DMA throughput below the qualified floor (suite-configured; 50 GB/s for the 1X module suite). Emitted by SohuDmaTestCase when its CentralSram throughput check fails in the active DMA flow.S2 ISOLATEQ9 ESCALATECollect the suite/test logs and artifacts for this failure. Escalate to Etched engineer with the collected logs.Hardware1X.PCIE.CSRAM_DMASohuDmaTestCase1X Module Test—supercomputing-swharness 2026.216
TH-PCIE-0004-S2Q9v10.2Sam JiangPCIE_HBM_DMA_INTEGRITY_MISMATCHPCIe->HBM DMA data integrity mismatch: dma_test_app read back data from an HBM region (EastHbm / WestHbm) that does not match the written random / bit-inverse pattern.S2 ISOLATEQ9 ESCALATECollect the suite/test logs and artifacts for this failure. Escalate to Etched engineer with the collected logs.Data1X.PCIE.HBM_DMASohuDmaTestCase1X Module Test—supercomputing-swharness 2026.216
TH-PCIE-0005-S2Q9v10.2Sam JiangPCIE_HBM_DMA_THROUGHPUT_BELOW_THRESHOLDPCIe->HBM DMA throughput below the qualified floor (suite-configured; 16 GB/s for the 1X module suite) on EastHbm / WestHbm transfers in dma_test_app.S2 ISOLATEQ9 ESCALATECollect the suite/test logs and artifacts for this failure. Escalate to Etched engineer with the collected logs.Hardware1X.PCIE.HBM_DMASohuDmaTestCase1X Module Test—supercomputing-swharness 2026.216
TH-PCIE-0006-S2Q6v10.2Ulysses KaoPCIE_SPEED_CHANGE_FAILEDPCIe speed change failed (Gen5<->Gen1 transition did not complete).S2 ISOLATEQ6 RETRYSuspect PCIe cable not fully seated into PV1 board, reseat the cable and retest once.Hardware1X.PCIE.LINK—1X Module Test—supercomputing-swharness 2026.216
TH-PCIE-0007-S4Q6v10.2Jack ChouPCIE_LANE_MARGIN_BELOW_THRESHOLDPCIe lane margin below threshold (EH>25mV EW>0.2UI, tentative).S4 TRIAGEQ6 RETRYSuspect PCIe cable not fully seated into PV1 board, reseat the cable and retest once.Hardware1X.PCIE.LINKSohuPcieLaneMarginTestCase1X Module Test—supercomputing-swharness 2026.216
TH-PCIE-0008-S2Q6v10.2Aidan HolmSOHU_ENDPOINT_NOT_ENUMERATEDSohu endpoint not enumerated (absent from PCIe tree / RPC proxy).S2 ISOLATEQ6 RETRYSuspect PCIe cable not fully seated into PV1 board, reseat the cable and retest once.Hardware1X.PCIE.ENUMERATIONPcieSetupTestCase
SohuVfioPingTestCase
SohuSaScreeningTestCase
1X Module TestETCH-35872: Chips not enumerated by RPC proxysupercomputing-swharness 2026.217
TH-PWR-0002-S4Q9v10.2Jack ChouPOWER_TELEMETRY_UNAVAILABLEPower telemetry unavailable (VBB / VRM / VM sensor RPC / collectors not responding, or expected VM sensors missing from the reading response).S4 TRIAGEQ9 ESCALATECollect the suite/test logs and artifacts for this failure. Escalate to Etched engineer with the collected logs.Hardware1X.PWR.VBB_POWERSohuPowerTelemetryTestCase
SohuVrmTestCase
SohuVmTestCase
1X Module Test—supercomputing-swharness 2026.216
TH-PWR-0003-S2Q9v10.2Jack ChouPOWER_DATA_OUT_OF_RANGEPower data out of the qualified range, or CPLD reports an active VRM FSM fault on the mezzanine.S2 ISOLATEQ9 ESCALATECollect the suite/test logs and artifacts for this failure. Escalate to Etched engineer with the collected logs.Hardware1X.PWR.VBB_POWERSohuPowerTelemetryTestCase
SohuVrmTestCase
1X Module Test—supercomputing-swharness 2026.216
TH-PWR-0004-S2Q9v10.2Ulysses KaoVM_SENSOR_OUT_OF_TOLERANCEVM sensor reading outside +/-5% of nominal.S2 ISOLATEQ9 ESCALATECollect the suite/test logs and artifacts for this failure. Escalate to Etched engineer with the collected logs.Hardware1X.PWR.VM_SENSORSohuVmTestCase1X Module TestETCH-34151: SohuVmTestCase failuresupercomputing-swharness 2026.216
TH-PWR-0005-S2Q9v10.2Ulysses KaoRAIL_ADJUST_READBACK_MISMATCHVoltage rail adjustment not reflected in the VM readback.S2 ISOLATEQ9 ESCALATECollect the suite/test logs and artifacts for this failure. Escalate to Etched engineer with the collected logs.Hardware1X.PWR.VM_SENSORSohuVmTestCase1X Module Test—supercomputing-swharness 2026.216
TH-PWR-0006-S4Q9v10.2James ChouVMIN_ABOVE_RATED_LIMITVmin above the rated limit for an SA/SAU rail.S4 TRIAGEQ9 ESCALATECollect the suite/test logs and artifacts for this failure. Escalate to Etched engineer with the collected logs.Hardware1X.PWR.VMINSohuLlamaMttTestCase1X Module TestETCH-32910: SohuLlamaMttTestCase Failuressupercomputing-swharness 2026.216
TH-PWR-0007-S2Q9v10.2James ChouUNEXPECTED_DVFS_RAMPDOWNUnexpected DVFS rampdown event during a workload.S2 ISOLATEQ9 ESCALATECollect the suite/test logs and artifacts for this failure. Escalate to Etched engineer with the collected logs.Hardware1X.PWR.DVFSSohuLlamaMttTestCase
SohuPowerVirusTestCase
1X Module TestETCH-32910: SohuLlamaMttTestCase Failuressupercomputing-swharness 2026.216
TH-PWR-0008-S2Q6v10.2Mykola ServetnykMODULE_POWER_ON_FAILUREModule failed to power on (indicators off, rail fault or short).S2 ISOLATEQ6 RETRYVerify that the green power indicators on the Sohu module are ON. Verify that both the PCIe cable and power cable are connected correctly and securely. If there is no trouble found, retest once.Hardware1X.PWR.POWER_ONBootloaderResultTestCase1X Module TestETCH-33918: SohuSecureBootRecoveryUpdateTestCase failuresupercomputing-swharness 2026.216
TH-SN-0001-S2Q9v10.2Sam JiangCHIP_ID_READ_OR_MISMATCHThe sohu_chip_id sysfs attribute of an enumerated Sohu endpoint could not be read or parsed, read back as all ones (device in reset), or reported a chip ID other than the one the resource configuration expects for that PCIe location.S2 ISOLATEQ9 ESCALATECollect the suite/test logs and artifacts for this failure. Escalate to Etched engineer with the collected logs.Data1X.SN.CHIP_IDSohuChipIdTestCase1X Module Test—supercomputing-swharness 2026.216
TH-SOHU-0001-S2Q9v10.2Aidan HolmASIC_RESET_DEASSERT_FAILEDASIC reset deassert failed.S2 ISOLATEQ9 ESCALATECollect the suite/test logs and artifacts for this failure. Escalate to Etched engineer with the collected logs.Hardware1X.SOHU.RESETProgramSecureBootloaderTestCase
BootloaderResultTestCase
1X Module Test—supercomputing-swharness 2026.217
TH-SOHU-0002-S2Q9v10.2James ChouSOHU_NOT_PINGABLEThe Sohu device did not respond to a ping over the RPC proxy: the firmware is not running, not reachable, or the device dropped off the proxy. Emitted when a device that had been posting stops answering, for example the post-campaign sweep after a repeated-FLR run.S2 ISOLATEQ9 ESCALATECollect the suite/test logs and artifacts for this failure. Escalate to Etched engineer with the collected logs.Hardware1X.SOHU.ASICSohuFlrTestCase
SohuVfioPingTestCase
SaSortRampupHbmSingleChipTestCase
SohuWeightLoadTestCase
1X Module TestETCH-35300: SaSortRampupHbmSingleChipTestCase failuressupercomputing-swharness 2026.216
TH-SOHU-0003-S2Q9v10.2Ulysses KaoPLDM_SENSOR_CHECK_FAILEDPLDM sensor discoverability or sanity check failed (boot-phase gate).S2 ISOLATEQ9 ESCALATECollect the suite/test logs and artifacts for this failure. Escalate to Etched engineer with the collected logs.Hardware1X.SOHU.PLDMSohuSecureBootRecoveryUpdateTestCase1X Module Test—supercomputing-swharness 2026.216
TH-SOHU-0004-S2Q9v10.2James ChouI2C_PERIPHERAL_READ_FAILAn I2C transaction on the Sohu mezzanine failed. This covers bring-up (initializing the ASIC-debug mux or any of the four Sohu I2C controllers, and reading the mezzanine board type) as well as the per-device probes on I2C0-I2C3, where a probe either failed its transaction or returned data that did not match the expected device identifier/register value. The first failure ends the test; for a probe it identifies the bus, device, and address.S2 ISOLATEQ9 ESCALATECollect the suite/test logs and artifacts for this failure. Escalate to Etched engineer with the collected logs.Hardware1X.SOHU.MEZZ_I2CSohuI2cTestCase1X Module TestETCH-35872: Chips not enumerated by RPC proxysupercomputing-swharness 2026.216
TH-SOHU-0005-S2Q9v10.2James ChouGPIO_LOOPBACK_MISMATCHAn MCPU GPIO did not read back its driven value. Covers both halves of the test: the chip-ID strap pins reading a value other than the expected chip_id, and the per-pin output->input loopback failing to observe either the flipped value or the restored original.S2 ISOLATEQ9 ESCALATECollect the suite/test logs and artifacts for this failure. Escalate to Etched engineer with the collected logs.Hardware1X.SOHU.MCPU_GPIOSohuGpioTestCase1X Module Test—supercomputing-swharness 2026.216
TH-SOHU-0006-S2Q9v10.2Ulysses KaoUART_PING_LOG_MISMATCHUART ping log message absent or content mismatch.S2 ISOLATEQ9 ESCALATECollect the suite/test logs and artifacts for this failure. Escalate to Etched engineer with the collected logs.Hardware1X.SOHU.UARTSohuUartTestCase1X Module Test—supercomputing-swharness 2026.216
TH-SOHU-0007-S2Q9v10.2James ChouJTAG_READBACK_MISMATCHA JTAG check did not produce the expected value, or could not be read at all: an ARC core cluster_id, the SA row/column build configuration, or a failure to select a core or read a register over the chain. The core1_cpu_reset read is recorded as a diagnostic measurement only and never fails the test. Failures before any JTAG transaction take the harness codes instead — an unknown jtag_interface is TH-HAR-0002, and no adapter matching serial_prefix or a missing OpenOCD binary are TH-HAR-0003.S2 ISOLATEQ9 ESCALATECollect the suite/test logs and artifacts for this failure. Escalate to Etched engineer with the collected logs.Hardware1X.SOHU.JTAGSohuJtagTestCase1X Module Test—supercomputing-swharness 2026.216
TH-SOHU-0008-S2Q9v10.2Sam JiangEFUSE_REGION_READ_FAILUREReading the eFuse region over RPC failed, so no init config could be decoded from the module.S2 ISOLATEQ9 ESCALATECollect the suite/test logs and artifacts for this failure. Escalate to Etched engineer with the collected logs.Hardware1X.SOHU.EFUSESohuEfuseTestCase1X Module Test—supercomputing-swharness 2026.216
TH-SOHU-0009-S2Q9v10.2Sam JiangEFUSE_WS_FT_STATUS_INCOMPLETEThe eFuse read succeeded but a wafer-sort or final-test completion flag (wafer_sort_complete, final_test_complete, mbist_complete, sa_complete, sensor_complete or hbm_complete) is False, so the module carries no record of a completed WS/FT flow including MBIST and SA repair.S2 ISOLATEQ9 ESCALATECollect the suite/test logs and artifacts for this failure. Escalate to Etched engineer with the collected logs.Data1X.SOHU.EFUSESohuEfuseTestCase1X Module Test—supercomputing-swharness 2026.216
TH-SOHU-0010-S2Q9v10.2Sam JiangBUS_CONNECTIVITY_CSR_ACCESS_FAILThe mCPU-resident bus connectivity sweep reported a non-zero failed count: at least one CSR check across the SoC blocks (MCPU, ISC, IPU, CSRAM, WCU, GPIO, PAD, sensors hub, PCIe, SAMU, datalink, MACs) did not pass. A check fails either because a write/verify/restore readback did not return the written pattern, or because a read-only field did not hold its expected value.S2 ISOLATEQ9 ESCALATECollect the suite/test logs and artifacts for this failure. Escalate to Etched engineer with the collected logs.Hardware1X.SOHU.SOC_BUSSohuBusConnectivityTestCase1X Module Test—supercomputing-swharness 2026.216
TH-SOHU-0011-S2Q9v10.2Ulysses KaoSRAM_TEST_FAILOn-chip SRAM test failure (stuck bits / readback mismatch) - the RPC read/write/invert checks reported failing SRAM regions, or the March C+ binary exited non-zero. Failing SRAM names go in the message / affected_instances, never into new codes (spec §1.2). Note - a non-zero March C+ exit is not yet distinguishable from a launch error; refine when the binary exposes an exit-status contract.S2 ISOLATEQ9 ESCALATECollect the suite/test logs and artifacts for this failure. Escalate to Etched engineer with the collected logs.MemoryMLT.SOHU.SOHU_CHIPSohuSramMemoryTestCase1X Module Test—supercomputing-swharness 2026.216
TH-SOHU-0012-S2Q9v10.2Sam JiangSA_MATMUL_NUMERIC_MISMATCHAn SA matmul dispatcher test binary exited non-zero: systolic-array outputs did not match the funcsim reference. sa_sort screening tolerates a bounded number of defective SA columns, so a non-zero exit means the mismatches went beyond what the health map is allowed to mask out.S2 ISOLATEQ9 ESCALATECollect the suite/test logs and artifacts for this failure. Escalate to Etched engineer with the collected logs.Hardware1X.SOHU.SASaSortRampupHbmSingleChipTestCase1X Module TestETCH-34131: SohuPowerVirusTestCase failuressupercomputing-swharness 2026.216
TH-SOHU-0014-S2Q9v10.2Sam JiangATTENTION_SAU_NUMERIC_MISMATCHAn attention/SAU dispatcher test binary exited non-zero: one or more attention, KV-flush or SAU operations did not match the funcsim reference.S2 ISOLATEQ9 ESCALATECollect the suite/test logs and artifacts for this failure. Escalate to Etched engineer with the collected logs.Hardware1X.SOHU.SAURunAllAttnTestsSingleChipTestCase
RunAllAttnHbmBypassTestsSingleChipTestCase
RunKvFlushTestsSingleChipTestCase
KvFlushAndAttentionSingleChipTestCase
KvFlushAndAttentionInterleavedSingleChipTestCase
1X Module TestETCH-35940: 267693980000009 - Failed RunAllAttnTestsSingleChipTestCasesupercomputing-swharness 2026.216
TH-SOHU-0015-S2Q9v10.2Aidan HolmWORKLOAD_HANG_OPERATION_TIMEOUTWorkload hang / operation timeout.S2 ISOLATEQ9 ESCALATECollect the suite/test logs and artifacts for this failure. Escalate to Etched engineer with the collected logs.Hardware1X.SOHU.WORKLOADKayakTestCase
SohuPowerVirusTestCase
SohuLlamaMttTestCase
1X Module TestETCH-35548: SohuPowerVirusThermalTestCase failuressupercomputing-swharness 2026.216
TH-SOHU-0016-S2Q9v10.2Ulysses KaoWEIGHT_LOAD_SPOT_CHECK_MISMATCHWeight-load spot check failed: HBM-resident weights did not match the on-disk model after load (weight_load_test_app non-zero exit).S2 ISOLATEQ9 ESCALATECollect the suite/test logs and artifacts for this failure. Escalate to Etched engineer with the collected logs.Data1X.SOHU.WEIGHT_LOADSohuWeightLoadTestCase1X Module Test—supercomputing-swharness 2026.216
TH-SOHU-0017-S2Q9v10.2James ChouINFERENCE_DISPATCH_TIME_ABOVE_LIMITSustained inference throughput on the million-token test did not reach the expected chip tokens/s (95% of the suite's expected_chip_tokens_per_second). Not wired yet: the check runs inside llama_mtt_app and the harness only sees the exit status, so a non-zero exit cannot be told apart from a model-creation or dataset failure. Emitting it needs the binary to signal the threshold failure distinctly, or the harness to parse MTT_results/metrics.txt.S2 ISOLATEQ9 ESCALATECollect the suite/test logs and artifacts for this failure. Escalate to Etched engineer with the collected logs.Hardware1X.SOHU.ASICSohuLlamaMttTestCase1X Module Test—supercomputing-swharness 2026.216
TH-SOHU-0018-S2Q9v10.2Aidan HolmEND_TO_END_INFERENCE_NUMERIC_MISMATCHEnd-to-end inference numeric mismatch vs reference.S2 ISOLATEQ9 ESCALATECollect the suite/test logs and artifacts for this failure. Escalate to Etched engineer with the collected logs.Hardware1X.SOHU.INFERENCESohuLlama8bFp8PrefillTestCase
SohuLlama8bFp8ForwardTestCase
SohuLlamaForwardIteratedTestCase
KayakTestCase
1X Module TestETCH-34695: SohuLlama8bFp8PrefillTestCase failuressupercomputing-swharness 2026.216
TH-SOHU-0019-S2Q9v10.2James ChouFLR_FAILEDA Function Level Reset cycle did not complete cleanly: the reset request failed or went unanswered within flr_timeout_s (default 5.0s), or the device did not become available and pingable again within recovery_timeout_s (default 10.0s). Reported for the first failing iteration of the FLR campaign; per-iteration round-trip times are recorded as flr_round_trip_* measurements and are not compared against a limit.S2 ISOLATEQ9 ESCALATECollect the suite/test logs and artifacts for this failure. Escalate to Etched engineer with the collected logs.Hardware1X.SOHU.PCIE_FLRSohuFlrTestCase1X Module Test—supercomputing-swharness 2026.216
TH-SOHU-0020-S2Q9v10.2Ulysses KaoSAU_PLL_CONFIG_FAILSAU/SA PLL configuration failure - firmware did not report a safe SAU PLL phase alignment after FLR, or a requested PLL glitch frequency did not read back within 5% of the target before the readback timeout.S2 ISOLATEQ9 ESCALATECollect the suite/test logs and artifacts for this failure. Escalate to Etched engineer with the collected logs.HardwareMLT.SOHU.SOHU_CHIPSohuSauPllPhaseAlignmentTestCase
SetPllGlitchFreqTestCase
1X Module TestETCH-35301: SohuVfioPingTestCase failuressupercomputing-swharness 2026.216
TH-SOHU-0021-S2Q9v10.2Jack ChouDEFECTIVE_SA_COLUMNS_EXCEED_LIMITDefective SA column count exceeds the screening limit. Retry is futile for a defect map.S2 ISOLATEQ9 ESCALATECollect the suite/test logs and artifacts for this failure. Escalate to Etched engineer with the collected logs.Hardware1X.SOHU.SASohuSaScreeningTestCase
SaSortRampupHbmSingleChipTestCase
1X Module TestETCH-35581: SohuSaScreeningTestCase failuressupercomputing-swharness 2026.216
TH-SOHU-0022-S2Q9v10.2Jack ChouPD_CHAIN_READ_FAILUREProcess detector (PD) chain read failure.S2 ISOLATEQ9 ESCALATECollect the suite/test logs and artifacts for this failure. Escalate to Etched engineer with the collected logs.Hardware1X.SOHU.PDSohuPdTestCase1X Module TestETCH-33887: SohuPdTestCase failuresupercomputing-swharness 2026.216
TH-SOHU-0023-S2Q9v10.2Ulysses KaoCHIP_BIN_BELOW_THRESHOLDChip bin below the acceptance threshold / failed the binning criteria (e.g. unbinnable SA column mask count, or illegal bin transition).S2 ISOLATEQ9 ESCALATECollect the suite/test logs and artifacts for this failure. Escalate to Etched engineer with the collected logs.Hardware1X.SOHU.BINNINGSohuChipBinTestCase1X Module Test—supercomputing-swharness 2026.216
TH-SOHU-0024-S5Q9v10.2Ulysses KaoSCREENING_DATA_MISSINGRequired screening data missing or failed to load (SA mask / bin inputs), including eFuse/Flash init-config read failures and invalid screening bin encodings.S5 CONFIGQ9 ESCALATECollect the suite/test logs and artifacts for this failure. Escalate to Etched engineer with the collected logs.Config1X.SOHU.SCREENING_DATASohuChipBinTestCase
SohuSaScreeningTestCase
SaSortRampupHbmSingleChipTestCase
1X Module TestETCH-34698supercomputing-swharness 2026.216
TH-SOHU-0025-S4Q9v10.2Ulysses KaoCHIP_STATE_SNAPSHOT_FAILEDChip state snapshot capture failed.S4 TRIAGEQ9 ESCALATECollect the suite/test logs and artifacts for this failure. Escalate to Etched engineer with the collected logs.Hardware1X.SOHU.SNAPSHOTSohuSnapTestCase1X Module Test—supercomputing-swharness 2026.216
TH-SOHU-0026-S2Q9 retiredv10.2Ulysses KaoPLL_GLITCH_FREQUENCY_READBACK_FAILEDRETIRED (ETCH-38346): historically emitted when PLL glitch frequency did not read back within 5% of the target before the timeout. New emissions use TH-SOHU-0020 (SAU_PLL_CONFIG_FAIL).S2 ISOLATEQ9 ESCALATECollect the suite/test logs and artifacts for this failure. Escalate to Etched engineer with the collected logs.Hardware1X.SOHU.PLLSetPllGlitchFreqTestCase1X Module Test—supercomputing-swharness 2026.216
TH-SOHU-0027-S2Q9v10.2Ulysses KaoVFIO_PING_LATENCY_OUT_OF_SPECVFIO ping responses were received but none met the allowed latency - the device is pingable but its response latency is out of spec. Distinct from TH-SOHU-0002 (no response at all).S2 ISOLATEQ9 ESCALATECollect the suite/test logs and artifacts for this failure. Escalate to Etched engineer with the collected logs.Hardware1X.SOHU.ASICSohuVfioPingTestCase1X Module Test—supercomputing-swharness 2026.216
TH-THM-0001-S2Q6v10.2Ulysses KaoTHERMAL_READING_OUT_OF_RANGEThermal diode temperature reading out of the qualified range, reported invalid by the sensor, or an uncalibrated mezzanine diode reading below 0 C (bad solder joint indicator). Failing channels go in the message / affected_instances, never into new codes (spec §1.2).S2 ISOLATEQ6 RETRYInspect the IBC TIM and ensure that the Sohu module is properly seated and secured in the fixture. Also verify that the Sohu module top cold plate is connected to the HRM cooling loop. If there is no trouble found, retest once.HardwareMLT.THM.SOHU_CHIPSohuThermalDiodeTestCase
SohuDtsTestCase
1X Module TestETCH-35857: MLT DTS faiure Peak-to-peak deviation: 33029224 uC is out of bounds (30000000)supercomputing-swharness 2026.216
TH-THM-0002-S2Q6v10.2Sam JiangDTS_SENSOR_VARIATION_EXCEEDEDThe peak-to-peak spread across the usable Sohu DTS readings exceeded the configured deviation limit (20C at L10). Zeroed and faulted sensors are excluded from the spread, so this reflects real sensor-to-sensor variation.S2 ISOLATEQ6 RETRYInspect the IBC TIM and ensure that the Sohu module is properly seated and secured in the fixture. Also verify that the Sohu module top cold plate is connected to the HRM cooling loop. If there is no trouble found, retest once.Hardware1X.THM.DTSSohuDtsTestCase1X Module TestETCH-35857: MLT DTS faiure Peak-to-peak deviation: 33029224 uC is out of bounds (30000000)supercomputing-swharness 2026.216
TH-THM-0003-S2Q9v10.2Sam JiangCTS_PROTECTION_NO_SHUTDOWNThe CTS trim code was driven to its maximum (lowest trip threshold) but the chip did not shut down: the CPLD cattrip latch bit in ASIC_CTRL1 was never set within the shutdown timeout.S2 ISOLATEQ9 ESCALATECollect the suite/test logs and artifacts for this failure. Escalate to Etched engineer with the collected logs.Hardware1X.THM.CTSSohuCtsTestCase1X Module Test—supercomputing-swharness 2026.216
TH-THM-0004-S2Q6v10.2Jack ChouCATASTROPHIC_TRIP_DURING_STRESSCatastrophic trip event during a stress workload.S2 ISOLATEQ6 RETRYInspect the IBC TIM and ensure that the Sohu module is properly seated and secured in the fixture. Also verify that the Sohu module top cold plate is connected to the HRM cooling loop. If there is no trouble found, retest once.Hardware1X.THM.TRIPSohuPowerVirusThermalTestCase1X Module TestETCH-35548: SohuPowerVirusThermalTestCase failuressupercomputing-swharness 2026.216
TH-THM-0005-S4Q9v10.2Sam JiangDTS_PTP_DEVIATION_OUT_OF_BOUNDSDTS peak-to-peak deviation under power virus out of bounds (threshold under review; bounds may be raised).S4 TRIAGEQ9 ESCALATEIf any temperature reading is out of spec verify that the affected unit has completed the required 45-min TIM baking process. Collect the suite/test logs and artifacts for this failure. Escalate to Etched engineer with the collected logs.Hardware1X.THM.DTSSohuDtsTestCase
SohuPowerVirusTestCase
1X Module TestETCH-35857: MLT DTS faiure Peak-to-peak deviation: 33029224 uC is out of bounds (30000000)supercomputing-swharness 2026.216
TH-THM-0006-S2Q9v10.2Jack ChouDTS_PEAK_TEMPERATURE_EXCEEDS_MAXPeak DTS temperature under power virus exceeds the expected maximum.S2 ISOLATEQ9 ESCALATEIf any temperature reading is out of spec verify that the affected unit has completed the required 45-min TIM baking process. Collect the suite/test logs and artifacts for this failure. Escalate to Etched engineer with the collected logs.Hardware1X.THM.DTSSohuPowerVirusThermalTestCase1X Module TestETCH-34688: SohuPowerVirusThermalTestCase failuressupercomputing-swharness 2026.216
TH-THM-0007-S4Q9v10.2Ulysses KaoTHERMAL_TELEMETRY_UNAVAILABLEThe TMP464 thermal diode data could not be obtained - RPC/connection failure over the VBB UART, or a malformed response (missing temperature array, unexpected channel count). The thermal verdict is inconclusive.S4 TRIAGEQ9 ESCALATECollect the suite/test logs and artifacts for this failure. Escalate to Etched engineer with the collected logs.SoftwareMLT.THM.SOHU_CHIPSohuThermalDiodeTestCase1X Module Test—supercomputing-swharness 2026.216
TH-THM-0017-S2Q9v10.4Mykola ServetnykCPLD_CATTRIP_DETECTEDThe mezzanine CPLD reports a cattrip: the MCU cattrip latch is set, MCU cattrip is live with VCC_1V2 good, or an HBM cattrip channel is active. Emitted by CpldDiagnosticsTestCase when run with fail_on_cattrip, so the verdict names the thermal event instead of the workload that died under it.S2 ISOLATEQ9 ESCALATEIf every slotted chip tripped, stop and check the station cooling (CDU status, coolant flow, HRM loop) before any retest. For a single chip, inspect the IBC TIM and reseat the module in the fixture; confirm the top cold plate is on the HRM loop. Escalate to Etched engineer with the CPLD reports and collector data.Hardware1X.THM.TRIPCpldDiagnosticsTestCaseMLT / 1X Module Test—supercomputing-swharness 2026.253

L10 Test codes

Refreshed from L10/l10_th_registry.yaml, with the packed 32-bit integer form. 228 codes.

Error Code IDPackedVerDoc RevOriginal AuthorNameMessageSeverityQuick ActionRecover / Troubleshooting ProcedureError TypeComponentTest CaseSourceBugsOwnerSince
TH-BIOS-0001-S5Q9358154241v10.3Ulysses KaoBIOS_EXPECTED_CONFIG_UNAVAILABLEExpected BIOS version or boot-order configuration could not be loaded; no BIOS verdict is available.S5 CONFIGQ9 ESCALATEFix the station, image, or suite configuration; do NOT route the unit to rework.ConfigL10.BIOS.BIOSCheckBiosVersion
CheckBiosBootOrder
L10 Test—supercomputing-swharness 2026.226
TH-BIOS-0002-S4Q9390660098v10.3Ulysses KaoBIOS_VERSION_QUERY_FAILEDThe running BIOS version could not be queried.S4 TRIAGEQ9 ESCALATEFix the station, image, or suite configuration; do NOT route the unit to rework.SoftwareL10.BIOS.BIOSCheckBiosVersionL10 Test—supercomputing-swharness 2026.226
TH-BIOS-0003-S4Q9390660099v10.3Ulysses KaoBIOS_VERSION_OUTPUT_INVALIDBIOS version output was empty, incomplete, or could not be parsed.S4 TRIAGEQ9 ESCALATEFix the station, image, or suite configuration; do NOT route the unit to rework.SoftwareL10.BIOS.BIOSCheckBiosVersionL10 Test—supercomputing-swharness 2026.226
TH-BIOS-0004-S5Q9358154244v10.3Ulysses KaoBIOS_VERSION_MISMATCHThe running BIOS version does not match the expected L10 release.S5 CONFIGQ9 ESCALATECapture logs and isolate the unit; do not continue the L10 suite on this code. Attach the per-test log and suite URL; route to FA; open Jira.ConfigL10.BIOS.BIOSCheckBiosVersionL10 Test—supercomputing-swharness 2026.226
TH-BIOS-0005-S4Q9390660101v10.3Ulysses KaoBIOS_BOOT_ORDER_QUERY_FAILEDThe configured BIOS boot order could not be queried.S4 TRIAGEQ9 ESCALATEFix the station, image, or suite configuration; do NOT route the unit to rework.SoftwareL10.BIOS.BIOSCheckBiosBootOrderL10 Test—supercomputing-swharness 2026.226
TH-BIOS-0006-S5Q9358154246v10.3Ulysses KaoBIOS_BOOT_ORDER_MISMATCHThe BIOS boot order does not match the required L10 configuration.S5 CONFIGQ9 ESCALATECapture logs and isolate the unit; do not continue the L10 suite on this code. Attach the per-test log and suite URL; route to FA; open Jira.ConfigL10.BIOS.BIOSCheckBiosBootOrderL10 Test—supercomputing-swharness 2026.226
TH-BIOS-0007-S4Q9357105671v10.3Ulysses KaoBIOS_UPDATE_FAILEDThe server BIOS update command failed or did not complete successfully.S4 TRIAGEQ9 ESCALATECapture logs and isolate the unit; do not continue the L10 suite on this code. Attach the per-test log and suite URL; route to FA; open Jira.ConfigL10.BIOS.BIOSSohuServerBiosUpdateL10 Test—supercomputing-swharness 2026.226
TH-BIOS-0008-S4Q9357105672v10.3Ulysses KaoBIOS_POST_UPDATE_VERIFY_FAILEDThe BIOS did not report the requested version after update and reboot.S4 TRIAGEQ9 ESCALATECapture logs and isolate the unit; do not continue the L10 suite on this code. Attach the per-test log and suite URL; route to FA; open Jira.ConfigL10.BIOS.BIOSSohuServerBiosUpdateL10 Test—supercomputing-swharness 2026.226
TH-BIOS-0009-S4Q9357105673v10.4Ulysses KaoBIOS_BOOT_ORDER_UPDATE_FAILEDStaging the required BIOS boot order via the BMC failed.S4 TRIAGEQ9 ESCALATECapture logs and isolate the unit; do not continue the L10 suite on this code. Attach the per-test log and suite URL; route to FA; open Jira.ConfigL10.BIOS.BIOSCheckBiosBootOrderL10 Test—supercomputing-swharness 2026.226
TH-BMC-0001-S5Q9358154241v10.3Ulysses KaoBMC_EXPECTED_CONFIG_UNAVAILABLEExpected BMC/product configuration could not be loaded; no BMC comparison verdict is available.S5 CONFIGQ9 ESCALATEFix the station, image, or suite configuration; do NOT route the unit to rework.ConfigL10.BMC.BMCBmcCheck
BmcCheckFanLocation
BmcCheckFanControl
BmcRecovery
L10 Test—supercomputing-swharness 2026.226
TH-BMC-0002-S4Q9390660098v10.3Ulysses KaoBMC_INVENTORY_QUERY_FAILEDThe BMC inventory or management query command failed.S4 TRIAGEQ9 ESCALATEFix the station, image, or suite configuration; do NOT route the unit to rework.SoftwareL10.BMC.BMCBmcCheckL10 Test—supercomputing-swharness 2026.226
TH-BMC-0003-S4Q9390660099v10.3Ulysses KaoBMC_INVENTORY_OUTPUT_INVALIDBMC inventory output was incomplete or could not be parsed.S4 TRIAGEQ9 ESCALATEFix the station, image, or suite configuration; do NOT route the unit to rework.SoftwareL10.BMC.BMCBmcCheckL10 Test—supercomputing-swharness 2026.226
TH-BMC-0004-S2Q9455671812v10.3Ulysses KaoBMC_IDENTITY_MISMATCHBMC-reported platform vendor, product, or model identity does not match expected configuration.S2 ISOLATEQ9 ESCALATECapture logs and isolate the unit; do not continue the L10 suite on this code. Attach the per-test log and suite URL; route to FA; open Jira.DataL10.BMC.BMCBmcCheckL10 Test—supercomputing-swharness 2026.226
TH-BMC-0005-S2Q9455671813v10.3Ulysses KaoBMC_MANAGEMENT_ADDRESS_MISMATCHThe BMC management IP address or MAC address does not match the expected server configuration.S2 ISOLATEQ9 ESCALATECapture logs and isolate the unit; do not continue the L10 suite on this code. Attach the per-test log and suite URL; route to FA; open Jira.DataL10.BMC.BMCBmcCheckL10 Test—supercomputing-swharness 2026.226
TH-BMC-0006-S5Q9358154246v10.3Ulysses KaoBMC_FIRMWARE_VERSION_MISMATCHThe running BMC firmware version does not match the expected L10 release.S5 CONFIGQ9 ESCALATECapture logs and isolate the unit; do not continue the L10 suite on this code. Attach the per-test log and suite URL; route to FA; open Jira.ConfigL10.BMC.BMCBmcCheckL10 Test—supercomputing-swharness 2026.226
TH-BMC-0007-S4Q9390660103v10.3Ulysses KaoBMC_FAN_LOCATION_PROGRAM_FAILEDThe BMC command to program fan locations failed.S4 TRIAGEQ9 ESCALATECapture logs and isolate the unit; do not continue the L10 suite on this code. Attach the per-test log and suite URL; route to FA; open Jira.SoftwareL10.BMC.BMCBmcCheckFanLocationL10 Test—supercomputing-swharness 2026.226
TH-BMC-0008-S4Q9390660104v10.3Ulysses KaoBMC_FAN_LOCATION_READBACK_FAILEDProgrammed fan-location data could not be read back from the BMC.S4 TRIAGEQ9 ESCALATEFix the station, image, or suite configuration; do NOT route the unit to rework.SoftwareL10.BMC.BMCBmcCheckFanLocationL10 Test—supercomputing-swharness 2026.226
TH-BMC-0009-S5Q9358154249v10.3Ulysses KaoBMC_FAN_CONFIG_UNAVAILABLEBMC fan-zone, PWM, or sensor configuration needed by the fan-control test is missing or invalid.S5 CONFIGQ9 ESCALATEFix the station, image, or suite configuration; do NOT route the unit to rework.ConfigL10.BMC.BMCBmcCheckFanControlL10 Test—supercomputing-swharness 2026.226
TH-BMC-0010-S4Q9390660106v10.3Ulysses KaoBMC_SENSOR_QUERY_FAILEDThe BMC sensor query failed or returned no usable fan/thermal readings.S4 TRIAGEQ9 ESCALATEFix the station, image, or suite configuration; do NOT route the unit to rework.SoftwareL10.BMC.BMCBmcCheckFanControlL10 Test—supercomputing-swharness 2026.226
TH-BMC-0011-S4Q6289800203v10.3Ulysses KaoBMC_CONNECTIVITY_FAILEDBMC connectivity validation observed packet loss or could not complete the configured reachability check.S4 TRIAGEQ6 RETRYRetry the affected L10 subset once and capture logs from the failing run. If persistent, isolate the unit; attach logs; route to FA; open Jira.NetworkL10.BMC.BMCBmcConnectivityCheck
BmcRecovery
L10 Test—supercomputing-swharness 2026.226
TH-BMC-0012-S4Q9289996812v10.3Ulysses KaoBMC_SSH_UNAVAILABLEAn SSH session to the BMC could not be established for the requested operation.S4 TRIAGEQ9 ESCALATEFix the station, image, or suite configuration; do NOT route the unit to rework.NetworkL10.BMC.BMCSohuServerBmcFirmwareUpdate
SohuServerBiosUpdate
PsuFirmwareUpdate
CpldFirmwareUpdate
L10VBBUpdate
BmcPowerCycle
L10 Test—supercomputing-swharness 2026.226
TH-BMC-0013-S4Q9390660109v10.3Ulysses KaoBMC_UPDATE_IMAGE_STAGING_FAILEDThe firmware image or update configuration could not be staged to the BMC.S4 TRIAGEQ9 ESCALATEFix the station, image, or suite configuration; do NOT route the unit to rework.SoftwareL10.BMC.BMCSohuServerBmcFirmwareUpdate
SohuServerBiosUpdate
PsuFirmwareUpdate
CpldFirmwareUpdate
L10VBBUpdate
L10 Test—supercomputing-swharness 2026.226
TH-BMC-0014-S4Q9357105678v10.3Ulysses KaoBMC_FIRMWARE_UPDATE_COMMAND_FAILEDThe BMC firmware update command failed or did not complete successfully.S4 TRIAGEQ9 ESCALATECapture logs and isolate the unit; do not continue the L10 suite on this code. Attach the per-test log and suite URL; route to FA; open Jira.ConfigL10.BMC.BMCSohuServerBmcFirmwareUpdateL10 Test—supercomputing-swharness 2026.226
TH-BMC-0015-S4Q9357105679v10.3Ulysses KaoBMC_POST_UPDATE_VERIFY_FAILEDThe BMC did not report the requested firmware version after update.S4 TRIAGEQ9 ESCALATECapture logs and isolate the unit; do not continue the L10 suite on this code. Attach the per-test log and suite URL; route to FA; open Jira.ConfigL10.BMC.BMCSohuServerBmcFirmwareUpdateL10 Test—supercomputing-swharness 2026.226
TH-BMC-0016-S4Q9357105680v10.3Ulysses KaoBMC_POWER_CYCLE_INTERVAL_SET_FAILEDThe requested BMC power-cycle interval could not be configured.S4 TRIAGEQ9 ESCALATEFix the station, image, or suite configuration; do NOT route the unit to rework.ConfigL10.BMC.BMCSetPowerCycleIntervalL10 Test—supercomputing-swharness 2026.226
TH-BMC-0017-S4Q9390660113v10.3Ulysses KaoBMC_SYSTEM_EVENT_LOG_QUERY_FAILEDThe BMC system-event log could not be read or parsed.S4 TRIAGEQ9 ESCALATEFix the station, image, or suite configuration; do NOT route the unit to rework.SoftwareL10.BMC.BMCStoreSystemLogStates
CheckSystemLogStates
L10 Test—supercomputing-swharness 2026.226
TH-BMC-0018-S4Q9373882898v10.3Ulysses KaoBMC_CRITICAL_EVENT_DETECTEDA new critical BMC/SEL event was detected between the stored baseline and the post-test log state.S4 TRIAGEQ9 ESCALATECapture logs and isolate the unit; do not continue the L10 suite on this code. Attach the per-test log and suite URL; route to FA; open Jira.HardwareL10.BMC.BMCCheckSystemLogStatesL10 Test—supercomputing-swharness 2026.226
TH-BMC-0019-S4Q9390660115v10.3Ulysses KaoBMC_RAW_COMMAND_FAILEDA required low-level BMC raw command failed or returned no response.S4 TRIAGEQ9 ESCALATEFix the station, image, or suite configuration; do NOT route the unit to rework.SoftwareL10.BMC.BMCBmcCheck
BmcCheckFanLocation
BmcCheckFanControl
L10 Test—supercomputing-swharness 2026.226
TH-BMC-0020-S5Q9358154260v10.3Ulysses KaoBMC_UPDATE_MODEL_CONFIG_UNAVAILABLEThe BMC update flow could not resolve the server model or target-specific update configuration.S5 CONFIGQ9 ESCALATEFix the station, image, or suite configuration; do NOT route the unit to rework.ConfigL10.BMC.BMCSohuServerBmcFirmwareUpdate
SohuServerBiosUpdate
PsuFirmwareUpdate
CpldFirmwareUpdate
L10VBBUpdate
L10 Test—supercomputing-swharness 2026.226
TH-C2C-0001-S2Q9371785729v10.3Ulysses KaoC2C_LINKUP_FAILEDC2C lanes failed to train or link up within the timeout: RX equalization did not converge after its configured attempts, or the link-up test reported one or more datalinks/lanes down.S2 ISOLATEQ9 ESCALATERetry the C2C subset up to three times in loopback mode with the affected lanes. Reseat the loopback fixture/cable per station SOP; confirm the FIR sweep ran before link-up. Isolate the module; attach the link-up PoR summary and per-lane data; route to FA; open Jira.CATEGORY_HARDWAREL10.C2C.SOHU_SERDESC2cLinkupMultiChipTestCase
C2cThroughputMultiChipTestCase
L10 Test—supercomputing-swharness 2026.226
TH-C2C-0004-S4Q9373882884v10.3Ulysses KaoC2C_LANE_MARGIN_BELOW_THRESHOLDWorst per-lane minimum BER from the eye-diagram sweep exceeded the configured ber_threshold; the SERDES margin spec is not final.S4 TRIAGEQ9 ESCALATERetry the lane-margin test up to three times; record the per-lane BER breakdown for each run. Route to SIVAL/platform triage with the per-lane BER matrices; do not isolate the module on this code alone until the SERDES margin spec is final.CATEGORY_HARDWAREL10.C2C.SOHU_SERDESC2cFirCdrSweepMultiChipTestCaseL10 Test—supercomputing-swharness 2026.226
TH-C2C-0005-S2Q9455671813v10.3Ulysses KaoC2C_PRBS_ERROR_THRESHOLD_EXCEEDEDThe C2C PRBS run completed but the observed bit-error count or rate exceeded the configured acceptance limit.S2 ISOLATEQ9 ESCALATECapture logs and isolate the unit; do not continue the L10 suite on this code. Attach the per-test log and suite URL; route to FA; open Jira.CATEGORY_DATAL10.C2C.SOHU_SERDESC2cPrbsMultiChipTestCaseL10 Test—supercomputing-swharness 2026.226
TH-C2C-0006-S4Q9390660102v10.3Ulysses KaoC2C_SWEEP_OUTPUT_INVALIDThe FIR/CDR or PRBS test did not produce complete, parseable lane results, so the C2C verdict is inconclusive.S4 TRIAGEQ9 ESCALATEFix the station, image, or suite configuration; do NOT route the unit to rework.SoftwareL10.C2C.SOHU_SERDESC2cFirCdrSweepMultiChipTestCase
C2cPrbsMultiChipTestCase
L10 Test—supercomputing-swharness 2026.226
TH-C2C-0007-S2Q9455671815v10.4Ulysses KaoC2C_INTEGRITY_MISMATCHBit-by-bit C2C loopback comparison found a data mismatch on at least one datalink/lane.S2 ISOLATEQ9 ESCALATECapture the per-lane error plots BEFORE retrying, then retry the C2C subset up to three times. Verify the loopback lane map matches the fixture wiring; reseat the fixture per station SOP. Isolate the module; attach the per-lane mismatch data; route to FA; open Jira.DataL10.C2C.SOHU_SERDESC2cIntegrityMultiChipTestCaseL10 Test—supercomputing-swharness 2026.226
TH-C2C-0008-S2Q9371785736v10.4Ulysses KaoC2C_THROUGHPUT_BELOW_THRESHOLDThe large C2C transfer did not meet its acceptance criteria: measured throughput below the configured percentage of line rate (90% in the 1X suite), or the post-FEC uncorrected error fraction above its limit.S2 ISOLATEQ9 ESCALATERetry the C2C subset up to three times with the affected mode and lanes. Reseat the loopback fixture; confirm the CSRAM PLL boost applied during the transfer. Isolate the module; attach throughput and post-FEC counters; route to FA; open Jira.HardwareL10.C2C.SOHU_SERDESC2cThroughputMultiChipTestCaseL10 Test—supercomputing-swharness 2026.226
TH-CPU-0001-S2Q6371589121v10.3Ulysses KaoCPU_STRESS_FAILstress-ng CPU stress failed because a stressor/verification error occurred or the tool returned its workload-failure status.S2 ISOLATEQ6 RETRYVerify station ambient/airflow nominal, rerun CPU subset. Inspect heatsink mounting and TIM per assembly SOP; remount if out of spec. Preserve unit; attach stress-ng logs + MCE excerpt; route to FA; open Jira.CATEGORY_HARDWAREL10.CPU.HOST_CPUCpuStressL10 Test—supercomputing-swharness 2026.226
TH-CPU-0003-S5Q9391708675v10.3Ulysses KaoCPU_STRESS_TOOL_UNAVAILABLEstress-ng is not installed or cannot be executed on the target; no CPU verdict is available (ERROR disposition; excluded from DUT yield).S5 CONFIGQ9 ESCALATEInstall stress-ng on the target (or rerun the package-install step), rerun CPU subset. If provisioning image is missing the package, route to test-infra; open Jira. Do NOT route the unit to rework or FA.CATEGORY_SOFTWAREL10.CPU.HOST_CPUCpuStressL10 Test—supercomputing-swharness 2026.226
TH-CPU-0004-S4Q6390463492v10.3Ulysses KaoCPU_STRESS_EXECUTION_ERRORstress-ng returned an execution, initialization, option, resource, unsupported-stressor, or signal error rather than a CPU workload verdict.S4 TRIAGEQ6 RETRYConfirm no other workload active on the DUT, rerun CPU subset. Route logs to engineering triage with the stress-ng exit code and dmesg excerpt.CATEGORY_SOFTWAREL10.CPU.HOST_CPUCpuStressL10 Test—supercomputing-swharness 2026.226
TH-CPU-0005-S4Q9390660101v10.3Ulysses KaoCPU_INVENTORY_QUERY_FAILEDThe CPU inventory command failed; no CPU BOM verdict is available.S4 TRIAGEQ9 ESCALATEFix the station, image, or suite configuration; do NOT route the unit to rework.SoftwareL10.CPU.HOST_CPUCheckCpuL10 Test—supercomputing-swharness 2026.226
TH-CPU-0006-S4Q9390660102v10.3Ulysses KaoCPU_INVENTORY_OUTPUT_INVALIDThe CPU inventory output was malformed or could not be parsed into processor records.S4 TRIAGEQ9 ESCALATEFix the station, image, or suite configuration; do NOT route the unit to rework.SoftwareL10.CPU.HOST_CPUCheckCpuL10 Test—supercomputing-swharness 2026.226
TH-CPU-0007-S2Q9371785735v10.3Ulysses KaoCPU_COUNT_MISMATCHThe discovered processor count does not match the expected L10 BOM.S2 ISOLATEQ9 ESCALATECapture logs and isolate the unit; do not continue the L10 suite on this code. Attach the per-test log and suite URL; route to FA; open Jira.HardwareL10.CPU.HOST_CPUCheckCpuL10 Test—supercomputing-swharness 2026.226
TH-CPU-0008-S2Q9455671816v10.3Ulysses KaoCPU_IDENTITY_MISMATCHA processor part number or manufacturer does not match the expected L10 BOM.S2 ISOLATEQ9 ESCALATECapture logs and isolate the unit; do not continue the L10 suite on this code. Attach the per-test log and suite URL; route to FA; open Jira.DataL10.CPU.HOST_CPUCheckCpuL10 Test—supercomputing-swharness 2026.226
TH-CPU-0009-S2Q9371785737v10.3Ulysses KaoCPU_TOPOLOGY_MISMATCHA processor core count or thread count does not match the expected L10 BOM.S2 ISOLATEQ9 ESCALATECapture logs and isolate the unit; do not continue the L10 suite on this code. Attach the per-test log and suite URL; route to FA; open Jira.HardwareL10.CPU.HOST_CPUCheckCpuL10 Test—supercomputing-swharness 2026.226
TH-CPU-0010-S4Q9357105674v10.3Ulysses KaoCPU_CLOCK_MISMATCHA processor base or maximum clock reported by inventory does not match the expected L10 BOM.S4 TRIAGEQ9 ESCALATECapture logs and isolate the unit; do not continue the L10 suite on this code. Attach the per-test log and suite URL; route to FA; open Jira.ConfigL10.CPU.HOST_CPUCheckCpuL10 Test—supercomputing-swharness 2026.226
TH-DISK-0001-S4Q9390660097v10.3Ulysses KaoDISK_INVENTORY_QUERY_FAILEDThe block-device or NVMe inventory command failed; no storage verdict is available.S4 TRIAGEQ9 ESCALATEFix the station, image, or suite configuration; do NOT route the unit to rework.SoftwareL10.DISK.STORAGECheckDisk
DiskFormat
DiskSmart
DiskStress
L10 Test—supercomputing-swharness 2026.226
TH-DISK-0002-S4Q9390660098v10.3Ulysses KaoDISK_INVENTORY_OUTPUT_INVALIDBlock-device or NVMe inventory output was malformed or could not be parsed.S4 TRIAGEQ9 ESCALATEFix the station, image, or suite configuration; do NOT route the unit to rework.SoftwareL10.DISK.STORAGECheckDisk
DiskFormat
DiskStress
L10 Test—supercomputing-swharness 2026.226
TH-DISK-0003-S2Q9304676867v10.3Ulysses KaoNO_DISKS_DETECTEDNo storage devices were detected although the L10 BOM requires disks.S2 ISOLATEQ9 ESCALATECapture logs and isolate the unit; do not continue the L10 suite on this code. Attach the per-test log and suite URL; route to FA; open Jira.StorageL10.DISK.STORAGECheckDisk
DiskSmart
L10 Test—supercomputing-swharness 2026.226
TH-DISK-0004-S2Q9304676868v10.3Ulysses KaoDISK_COUNT_MISMATCHThe discovered disk count does not match the expected L10 BOM.S2 ISOLATEQ9 ESCALATECapture logs and isolate the unit; do not continue the L10 suite on this code. Attach the per-test log and suite URL; route to FA; open Jira.StorageL10.DISK.STORAGECheckDiskL10 Test—supercomputing-swharness 2026.226
TH-DISK-0005-S2Q9455671813v10.3Ulysses KaoDISK_IDENTITY_OR_CAPACITY_MISMATCHA disk model, serial number, namespace, or capacity does not match the expected L10 BOM.S2 ISOLATEQ9 ESCALATECapture logs and isolate the unit; do not continue the L10 suite on this code. Attach the per-test log and suite URL; route to FA; open Jira.DataL10.DISK.STORAGECheckDiskL10 Test—supercomputing-swharness 2026.226
TH-DISK-0006-S4Q9357105670v10.3Ulysses KaoMIXED_DRIVE_CONFIGURATIONInstalled drives do not satisfy the required homogeneous model/capacity configuration.S4 TRIAGEQ9 ESCALATECapture logs and isolate the unit; do not continue the L10 suite on this code. Attach the per-test log and suite URL; route to FA; open Jira.ConfigL10.DISK.STORAGECheckDiskL10 Test—supercomputing-swharness 2026.226
TH-DISK-0007-S5Q9358154247v10.3Ulysses KaoBOOT_DEVICE_UNDETERMINEDThe test could not reliably identify the host boot device and therefore could not safely select data drives.S5 CONFIGQ9 ESCALATEFix the station, image, or suite configuration; do NOT route the unit to rework.ConfigL10.DISK.STORAGEDiskFormat
DiskStress
L10 Test—supercomputing-swharness 2026.226
TH-DISK-0008-S5Q9358154248v10.3Ulysses KaoNO_TESTABLE_NVME_DEVICESNo eligible non-boot NVMe device remained after discovery and configured exclusions.S5 CONFIGQ9 ESCALATEFix the station, image, or suite configuration; do NOT route the unit to rework.ConfigL10.DISK.STORAGEDiskFormat
DiskSmart
DiskStress
L10 Test—supercomputing-swharness 2026.226
TH-DISK-0009-S2Q9304676873v10.3Ulysses KaoNVME_NAMESPACE_MISSINGAn expected NVMe controller has no usable namespace and automatic formatting is disabled.S2 ISOLATEQ9 ESCALATECapture logs and isolate the unit; do not continue the L10 suite on this code. Attach the per-test log and suite URL; route to FA; open Jira.StorageL10.DISK.NVMEDiskFormatL10 Test—supercomputing-swharness 2026.226
TH-DISK-0010-S4Q9306774026v10.3Ulysses KaoNVME_FORMAT_FAILEDThe NVMe format or namespace creation command failed.S4 TRIAGEQ9 ESCALATECapture logs and isolate the unit; do not continue the L10 suite on this code. Attach the per-test log and suite URL; route to FA; open Jira.StorageL10.DISK.NVMEDiskFormatL10 Test—supercomputing-swharness 2026.226
TH-DISK-0011-S2Q9304676875v10.3Ulysses KaoNVME_NAMESPACE_NOT_CREATEDThe expected NVMe namespace was still absent after the format/namespace operation completed.S2 ISOLATEQ9 ESCALATECapture logs and isolate the unit; do not continue the L10 suite on this code. Attach the per-test log and suite URL; route to FA; open Jira.StorageL10.DISK.NVMEDiskFormatL10 Test—supercomputing-swharness 2026.226
TH-DISK-0012-S2Q9304676876v10.3Ulysses KaoNVME_SMART_SELF_TEST_FAILEDAn NVMe device self-test completed with a failure or did not complete successfully.S2 ISOLATEQ9 ESCALATECapture logs and isolate the unit; do not continue the L10 suite on this code. Attach the per-test log and suite URL; route to FA; open Jira.StorageL10.DISK.NVMEDiskSmartL10 Test—supercomputing-swharness 2026.226
TH-DISK-0013-S4Q9390660109v10.3Ulysses KaoNVME_SMART_DATA_UNAVAILABLESMART/health data could not be read for an eligible NVMe device.S4 TRIAGEQ9 ESCALATEFix the station, image, or suite configuration; do NOT route the unit to rework.SoftwareL10.DISK.NVMEDiskSmartL10 Test—supercomputing-swharness 2026.226
TH-DISK-0014-S2Q9304676878v10.3Ulysses KaoNVME_SMART_CRITICAL_WARNINGThe NVMe SMART critical-warning field is non-zero.S2 ISOLATEQ9 ESCALATECapture logs and isolate the unit; do not continue the L10 suite on this code. Attach the per-test log and suite URL; route to FA; open Jira.StorageL10.DISK.NVMEDiskSmartL10 Test—supercomputing-swharness 2026.226
TH-DISK-0015-S2Q9304676879v10.3Ulysses KaoNVME_AVAILABLE_SPARE_BELOW_THRESHOLDNVMe available spare is below the device or configured threshold.S2 ISOLATEQ9 ESCALATECapture logs and isolate the unit; do not continue the L10 suite on this code. Attach the per-test log and suite URL; route to FA; open Jira.StorageL10.DISK.NVMEDiskSmartL10 Test—supercomputing-swharness 2026.226
TH-DISK-0016-S2Q9304676880v10.3Ulysses KaoNVME_MEDIA_ERRORS_DETECTEDNVMe SMART reports one or more media/data-integrity errors.S2 ISOLATEQ9 ESCALATECapture logs and isolate the unit; do not continue the L10 suite on this code. Attach the per-test log and suite URL; route to FA; open Jira.StorageL10.DISK.NVMEDiskSmartL10 Test—supercomputing-swharness 2026.226
TH-DISK-0017-S4Q9373882897v10.3Ulysses KaoNVME_TEMPERATURE_OUT_OF_RANGENVMe temperature is outside the configured safe operating range.S4 TRIAGEQ9 ESCALATECapture logs and isolate the unit; do not continue the L10 suite on this code. Attach the per-test log and suite URL; route to FA; open Jira.HardwareL10.DISK.NVMEDiskSmartL10 Test—supercomputing-swharness 2026.226
TH-DISK-0018-S2Q9304676882v10.3Ulysses KaoNVME_WEAR_LIMIT_EXCEEDEDNVMe percentage-used or wear indicator exceeds the configured acceptance limit.S2 ISOLATEQ9 ESCALATECapture logs and isolate the unit; do not continue the L10 suite on this code. Attach the per-test log and suite URL; route to FA; open Jira.StorageL10.DISK.NVMEDiskSmartL10 Test—supercomputing-swharness 2026.226
TH-DISK-0019-S2Q6304480275v10.3Ulysses KaoDISK_STRESS_FIO_FAILEDThe fio disk stress workload returned a workload-failure status for an eligible drive.S2 ISOLATEQ6 RETRYRetry the affected L10 subset once and capture logs from the failing run. If persistent, isolate the unit; attach logs; route to FA; open Jira.StorageL10.DISK.STORAGEDiskStressL10 Test—supercomputing-swharness 2026.226
TH-DISK-0020-S4Q9390660116v10.3Ulysses KaoDISK_STRESS_OUTPUT_INVALIDfio output was missing or could not be parsed into valid per-drive results.S4 TRIAGEQ9 ESCALATEFix the station, image, or suite configuration; do NOT route the unit to rework.SoftwareL10.DISK.STORAGEDiskStressL10 Test—supercomputing-swharness 2026.226
TH-DMA-0002-S2Q6371589122v10.4Ulysses KaoDMA_DATA_PATH_TEST_FAILEDHost-chip DMA data-path test failureS2 ISOLATEQ6 RETRYRerun the DMA subset up to 3 times; reseat the module if failures persist. Preserve unit; attach dma_test_app output and seed; isolate the module and route to triage.HardwareL10.DMA.HOST_CHIP_PATHSohuDmaMultiChipTestCaseL10 Test—supercomputing-swharness 2026.226
TH-ENV-0005-S4Q9289996805v10.3Ulysses KaoMODEL_REGISTRY_MOUNT_FAILEDThe model-registry NFS share could not be mounted or validated on the L10 host.S4 TRIAGEQ9 ESCALATEFix the station, image, or suite configuration; do NOT route the unit to rework.NetworkL10.ENV.MODEL_REGISTRYModelRegistryNfsMountTestCaseL10 Test—supercomputing-swharness 2026.226
TH-ENV-0006-S5Q9458817542v10.3Ulysses KaoMODEL_ARTIFACT_UNAVAILABLEA required model artifact, Hugging Face cache, or model path is missing or unreadable.S5 CONFIGQ9 ESCALATEFix the station, image, or suite configuration; do NOT route the unit to rework.DataL10.ENV.MODEL_REGISTRYStageModelRegistryToShmTestCase
SohuMlpTp8TestCase
SohuLlama70bForwardIteratedTestCase
SohuLlama70bHp8ForwardIteratedTestCase
SohuLlamaHp2Up4CachedInferenceMaxTestCase
SohuLlamaHp2Up4NospecInferenceMaxTestCase
SohuLlamaHp8CachedInferenceMaxTestCase
Llama8bFp8Tp1SmokeTestCase
L10 Test—supercomputing-swharness 2026.226
TH-ENV-0007-S4Q9424214535v10.3Ulysses KaoMODEL_STAGE_TO_SHM_FAILEDThe required model artifact could not be copied or staged into shared memory.S4 TRIAGEQ9 ESCALATEFix the station, image, or suite configuration; do NOT route the unit to rework.ResourceL10.ENV.SHMStageModelRegistryToShmTestCaseL10 Test—supercomputing-swharness 2026.226
TH-ENV-0008-S4Q9424214536v10.3Ulysses KaoMODEL_SHM_CLEANUP_FAILEDThe staged model could not be removed from shared memory during cleanup.S4 TRIAGEQ9 ESCALATEFix the station, image, or suite configuration; do NOT route the unit to rework.ResourceL10.ENV.SHMFreeModelRegistryFromShmTestCaseL10 Test—supercomputing-swharness 2026.226
TH-ENV-0009-S4Q9289996809v10.4Ulysses KaoHOST_OR_BMC_UNREACHABLEThe station host or its BMC did not answer ping or SSH after boot, so no module test could start.S4 TRIAGEQ9 ESCALATECheck station power, BMC network and management cabling; confirm the host answers ping and ssh. Route to test-infra with the ping/ssh transcript. Do NOT route any module to rework or FA on this code.NetworkL10.ENV.STATIONSohuHostRebootTestCase
BmcPowerCycle
BmcConnectivityCheck
L10 Test—supercomputing-swharness 2026.226
TH-ENV-0010-S4Q9357105674v10.4Ulysses KaoPLX_SWITCH_DISCOVERY_FAILEDPLX daemon reported no PEX switchesS4 TRIAGEQ9 ESCALATECheck and update the VBB MCU firmware, then rerun the affected test. Escalate to Etched if no PEX switches are reported after the firmware check.ConfigL10.ENV.STATIONCheckPlxDaemonFirmwareVersion
UpdatePlxDaemonFirmwareVersion
L10 Test—supercomputing-swharness 2026.226
TH-ENV-0011-S4Q9357105675v10.4Ulysses KaoHOST_DRIVER_SETUP_FAILEDA host driver/setup utility step failed: kernel module reload, PCIe teardown or bus rescan, sysfs parameter write, or log-reader activation returned non-zero.S4 TRIAGEQ9 ESCALATEFix station host environment (reload the driver, restore permissions) and rerun the setup subset. Route to test-infra with the command output and lsmod/dmesg excerpt. Do NOT route the unit to rework or FA.ConfigL10.ENV.STATIONSoftwareProvisioning
BroadcomUpdateFwAndConfigure
L10 Test—supercomputing-swharness 2026.226
TH-ENV-0012-S4Q9424214540v10.4Ulysses KaoWEIGHTS_STAGE_TO_DISK_FAILEDThe requested model weights could not be mirrored onto the server's local disk, or the destination lacked the free space to hold them.S4 TRIAGEQ9 ESCALATEFix the station, image, or suite configuration; do NOT route the unit to rework.ResourceL10.ENV.WEIGHTS_CACHEStageWeightsTestCaseL10 Test—supercomputing-swharness 2026.253
TH-ENV-0013-S4Q9424214541v10.4Ulysses KaoWEIGHTS_DISK_CLEANUP_FAILEDThe staged model weights could not be removed from the server's local disk during cleanup.S4 TRIAGEQ9 ESCALATEFix the station, image, or suite configuration; do NOT route the unit to rework.ResourceL10.ENV.WEIGHTS_CACHEFreeWeightsTestCaseL10 Test—supercomputing-swharness 2026.253
TH-FW-0001-S2Q9355008513v10.3Ulysses KaoSOHU_FIRMWARE_UPDATE_FAILEDSohu app firmware update failed or ASIC not pingable after updateS2 ISOLATEQ9 ESCALATECapture the UART log for the update window; verify the staged image package matches the release. Escalate to firmware with the UART log and the image package release id; do not retry blind.CATEGORY_CONFIGL10.FW.FIRMWAREMultiChipSohuHotReloadFirmwareUpdateTestCaseL10 Test—supercomputing-swharness 2026.226
TH-FW-0005-S5Q2357695493v10.3Ulysses KaoFIXTURE_FIRMWARE_UPDATE_FAILEDFixture firmware update failed (golden VBB / retimer): OpenOCD flash, ST-Link adapter, post-flash UART/RPC ready check, or application firmware-hash verification did not succeed.S5 CONFIGQ2 WARM_REBOOTHalt testing and escalate to Etched.CATEGORY_CONFIGL10.FW.FIRMWAREL10VBBUpdateL10 Test—supercomputing-swharness 2026.226
TH-FW-0010-S5Q9358154250v10.3Ulysses KaoEXPECTED_VERSION_CONFIG_UNAVAILABLEExpected host or component version data could not be loaded; no version verdict is available.S5 CONFIGQ9 ESCALATEFix the station, image, or suite configuration; do NOT route the unit to rework.ConfigL10.FW.FIRMWARECheckOs
CheckKernelVersion
CheckSohuFwVersion
CheckPsuFirmwareVersion
CheckCpldBpFirmwareVersion
L10 Test—supercomputing-swharness 2026.226
TH-FW-0011-S4Q9390660107v10.3Ulysses KaoHOST_OS_VERSION_QUERY_FAILEDThe host operating-system release could not be queried.S4 TRIAGEQ9 ESCALATEFix the station, image, or suite configuration; do NOT route the unit to rework.SoftwareL10.FW.HOST_OSCheckOsL10 Test—supercomputing-swharness 2026.226
TH-FW-0012-S4Q9390660108v10.3Ulysses KaoHOST_OS_VERSION_OUTPUT_INVALIDOperating-system release output was incomplete or could not be parsed.S4 TRIAGEQ9 ESCALATEFix the station, image, or suite configuration; do NOT route the unit to rework.SoftwareL10.FW.HOST_OSCheckOsL10 Test—supercomputing-swharness 2026.226
TH-FW-0013-S5Q9358154253v10.3Ulysses KaoHOST_OS_VERSION_MISMATCHThe host operating-system release does not match the required L10 image.S5 CONFIGQ9 ESCALATECapture logs and isolate the unit; do not continue the L10 suite on this code. Attach the per-test log and suite URL; route to FA; open Jira.ConfigL10.FW.HOST_OSCheckOsL10 Test—supercomputing-swharness 2026.226
TH-FW-0014-S4Q9390660110v10.3Ulysses KaoHOST_KERNEL_VERSION_QUERY_FAILEDThe running host kernel version could not be queried.S4 TRIAGEQ9 ESCALATEFix the station, image, or suite configuration; do NOT route the unit to rework.SoftwareL10.FW.HOST_KERNELCheckKernelVersionL10 Test—supercomputing-swharness 2026.226
TH-FW-0015-S4Q9390660111v10.3Ulysses KaoHOST_KERNEL_VERSION_OUTPUT_INVALIDKernel version output was empty or could not be parsed.S4 TRIAGEQ9 ESCALATEFix the station, image, or suite configuration; do NOT route the unit to rework.SoftwareL10.FW.HOST_KERNELCheckKernelVersionL10 Test—supercomputing-swharness 2026.226
TH-FW-0016-S5Q9358154256v10.3Ulysses KaoHOST_KERNEL_VERSION_MISMATCHThe running host kernel does not match the required L10 release.S5 CONFIGQ9 ESCALATECapture logs and isolate the unit; do not continue the L10 suite on this code. Attach the per-test log and suite URL; route to FA; open Jira.ConfigL10.FW.HOST_KERNELCheckKernelVersionL10 Test—supercomputing-swharness 2026.226
TH-FW-0017-S4Q9390660113v10.3Ulysses KaoSOHU_FIRMWARE_VERSION_QUERY_FAILEDThe running Sohu firmware version could not be queried.S4 TRIAGEQ9 ESCALATEFix the station, image, or suite configuration; do NOT route the unit to rework.SoftwareL10.FW.SOHUCheckSohuFwVersionL10 Test—supercomputing-swharness 2026.226
TH-FW-0018-S5Q9358154258v10.3Ulysses KaoSOHU_FIRMWARE_VERSION_MISMATCHThe running Sohu firmware version does not match the required L10 release.S5 CONFIGQ9 ESCALATECapture logs and isolate the unit; do not continue the L10 suite on this code. Attach the per-test log and suite URL; route to FA; open Jira.CATEGORY_CONFIGL10.FW.SOHUCheckSohuFwVersionL10 Test—supercomputing-swharness 2026.226
TH-FW-0019-S4Q9390660115v10.3Ulysses KaoPSU_FIRMWARE_VERSION_QUERY_FAILEDOne or more PSU firmware versions could not be queried.S4 TRIAGEQ9 ESCALATEFix the station, image, or suite configuration; do NOT route the unit to rework.SoftwareL10.FW.PSUCheckPsuFirmwareVersionL10 Test—supercomputing-swharness 2026.226
TH-FW-0020-S5Q9358154260v10.3Ulysses KaoPSU_FIRMWARE_VERSION_MISMATCHA PSU firmware version does not match the required L10 release.S5 CONFIGQ9 ESCALATECapture logs and isolate the unit; do not continue the L10 suite on this code. Attach the per-test log and suite URL; route to FA; open Jira.ConfigL10.FW.PSUCheckPsuFirmwareVersionL10 Test—supercomputing-swharness 2026.226
TH-FW-0021-S4Q9390660117v10.3Ulysses KaoCPLD_BP_FIRMWARE_VERSION_QUERY_FAILEDThe backplane/CPLD firmware version could not be queried.S4 TRIAGEQ9 ESCALATEFix the station, image, or suite configuration; do NOT route the unit to rework.SoftwareL10.FW.CPLDCheckCpldBpFirmwareVersionL10 Test—supercomputing-swharness 2026.226
TH-FW-0022-S5Q9358154262v10.3Ulysses KaoCPLD_BP_FIRMWARE_VERSION_MISMATCHThe backplane/CPLD firmware version does not match the required L10 release.S5 CONFIGQ9 ESCALATECapture logs and isolate the unit; do not continue the L10 suite on this code. Attach the per-test log and suite URL; route to FA; open Jira.ConfigL10.FW.CPLDCheckCpldBpFirmwareVersionL10 Test—supercomputing-swharness 2026.226
TH-FW-0023-S4Q9357105687v10.3Ulysses KaoPSU_FIRMWARE_UPDATE_FAILEDThe PSU firmware update command failed or did not complete successfully.S4 TRIAGEQ9 ESCALATECapture logs and isolate the unit; do not continue the L10 suite on this code. Attach the per-test log and suite URL; route to FA; open Jira.ConfigL10.FW.PSUPsuFirmwareUpdateL10 Test—supercomputing-swharness 2026.226
TH-FW-0024-S4Q9357105688v10.3Ulysses KaoPSU_POST_UPDATE_VERIFY_FAILEDA PSU did not report the requested firmware version after update.S4 TRIAGEQ9 ESCALATECapture logs and isolate the unit; do not continue the L10 suite on this code. Attach the per-test log and suite URL; route to FA; open Jira.ConfigL10.FW.PSUPsuFirmwareUpdateL10 Test—supercomputing-swharness 2026.226
TH-FW-0025-S4Q9357105689v10.3Ulysses KaoCPLD_FIRMWARE_UPDATE_FAILEDThe CPLD/backplane firmware update command failed or did not complete successfully.S4 TRIAGEQ9 ESCALATECapture logs and isolate the unit; do not continue the L10 suite on this code. Attach the per-test log and suite URL; route to FA; open Jira.ConfigL10.FW.CPLDCpldFirmwareUpdateL10 Test—supercomputing-swharness 2026.226
TH-FW-0026-S4Q9357105690v10.3Ulysses KaoCPLD_POST_UPDATE_VERIFY_FAILEDThe CPLD/backplane did not report the requested firmware version after update.S4 TRIAGEQ9 ESCALATECapture logs and isolate the unit; do not continue the L10 suite on this code. Attach the per-test log and suite URL; route to FA; open Jira.ConfigL10.FW.CPLDCpldFirmwareUpdateL10 Test—supercomputing-swharness 2026.226
TH-FW-0027-S4Q9357105691v10.3Ulysses KaoSOFTWARE_PROVISIONING_FAILEDThe L10 host software provisioning workflow failed to apply the required software state.S4 TRIAGEQ9 ESCALATECapture logs and isolate the unit; do not continue the L10 suite on this code. Attach the per-test log and suite URL; route to FA; open Jira.ConfigL10.FW.HOST_SWSoftwareProvisioningL10 Test—supercomputing-swharness 2026.226
TH-FW-0028-S4Q9390660124v10.3Ulysses KaoLINUX_PACKAGE_INSTALL_FAILEDA required Linux package could not be installed or configured.S4 TRIAGEQ9 ESCALATECapture logs and isolate the unit; do not continue the L10 suite on this code. Attach the per-test log and suite URL; route to FA; open Jira.SoftwareL10.FW.HOST_SWInstallLinuxPackagesTestCaseL10 Test—supercomputing-swharness 2026.226
TH-FW-0029-S4Q9357105693v10.3Ulysses KaoSOHU_BOOTLOADER_UPDATE_FAILEDThe Sohu bootloader update command failed or the device was not usable after programming.S4 TRIAGEQ9 ESCALATECapture logs and isolate the unit; do not continue the L10 suite on this code. Attach the per-test log and suite URL; route to FA; open Jira.ConfigL10.FW.SOHU_BOOTLOADERUpdateSohuBootloaderL10 Test—supercomputing-swharness 2026.226
TH-FW-0030-S4Q9357105694v10.3Ulysses KaoSOHU_BOOTLOADER_POST_UPDATE_VERIFY_FAILEDThe running Sohu bootloader does not match the requested image after update.S4 TRIAGEQ9 ESCALATECapture logs and isolate the unit; do not continue the L10 suite on this code. Attach the per-test log and suite URL; route to FA; open Jira.ConfigL10.FW.SOHU_BOOTLOADERUpdateSohuBootloaderL10 Test—supercomputing-swharness 2026.226
TH-FW-0031-S4Q9390660127v10.3Ulysses KaoHOST_SYSTEM_LOG_CRITICAL_EVENT_DETECTEDA new critical host kernel, service, or system event was detected after the L10 workload.S4 TRIAGEQ9 ESCALATECapture logs and isolate the unit; do not continue the L10 suite on this code. Attach the per-test log and suite URL; route to FA; open Jira.SoftwareL10.FW.HOST_SWCheckSystemLogStatesL10 Test—supercomputing-swharness 2026.226
TH-FW-0032-S4Q9357105696v10.4Ulysses KaoSOHU_FIRMWARE_HASH_MISMATCHThe ASIC booted application firmware after the update, but the running image hash does not match the hash in the image package that was just staged.S4 TRIAGEQ9 ESCALATECompare the staged image package against the intended release package; confirm the station is serving the right build. Route to firmware/test-infra triage with both hashes and the package release id.ConfigL10.FW.FIRMWAREMultiChipSohuHotReloadFirmwareUpdateTestCaseL10 Test—supercomputing-swharness 2026.226
TH-FW-0033-S5Q9358154273v10.4Ulysses KaoDVFS_PROFILE_APPLY_FAILEDBoard DVFS profile detection or application failedS5 CONFIGQ9 ESCALATEVerify the board ID and profile tables. Escalate if the profile is missing for this board revision.ConfigL10.FW.FIRMWARESohuSetClockProfileMultiChipTestCaseL10 Test—supercomputing-swharness 2026.226
TH-FW-0034-S5Q9358154274v10.4Ulysses KaoSOHU_HOT_RELOAD_INELIGIBLEHot reload could not start, so no firmware was writtenS5 CONFIGQ9 ESCALATEFix the station, image, or suite configuration; do NOT route the unit to rework.ConfigL10.FW.FIRMWAREMultiChipSohuHotReloadFirmwareUpdateTestCaseL10 Test—supercomputing-swharness 2026.226
TH-FW-0035-S4Q9390660131v10.4Ulysses KaoSOHU_SECURITY_STATE_QUERY_FAILEDThe running Sohu firmware did not report its security mode or TPM state, so the required provisioning could not be judged.S4 TRIAGEQ9 ESCALATEFix the station, image, or suite configuration; do NOT route the unit to rework.SoftwareL10.FW.SOHUCheckSohuSecurityStateL10 Test—supercomputing-swharness 2026.260
TH-FW-0036-S2Q9438894628v10.4Ulysses KaoSOHU_SECURITY_MODE_MISMATCHThe running Sohu firmware does not enforce the required security mode, so the unit is not running production-locked firmware.S2 ISOLATEQ9 ESCALATECapture logs and isolate the unit; do not continue the L10 suite on this code. Attach the per-test log and suite URL; route to FA; open Jira.SecurityL10.FW.SOHUCheckSohuSecurityStateL10 Test—supercomputing-swharness 2026.260
TH-FW-0037-S2Q9438894629v10.4Ulysses KaoSOHU_TPM_PROVISIONING_MISMATCHThe Sohu TPM does not carry the required provisioning: its anti-rollback state is not permanent, or debug signing keys are not revoked.S2 ISOLATEQ9 ESCALATECapture logs and isolate the unit; do not continue the L10 suite on this code. Attach the per-test log and suite URL; route to FA; open Jira.SecurityL10.FW.SOHUCheckSohuSecurityStateL10 Test—supercomputing-swharness 2026.260
TH-FW-0038-S2Q9438894630v10.4Ulysses KaoSOHU_SPDM_ATTESTATION_FAILEDA Sohu did not attest over SPDM: its certificate chain does not validate against the required trust anchor, its measurements do not match the policy, it did not answer, or its attestation report is unusable.S2 ISOLATEQ9 ESCALATECapture logs and isolate the unit; do not continue the L10 suite on this code. Attach the per-chip transcript, report and suite URL; route to FA; open Jira.SecurityL10.FW.SOHUSpdmAttestMultiChipTestCaseL10 Test—supercomputing-swharness 2026.260
TH-FW-0039-S4Q9390660135v10.4Ulysses KaoSOHU_SPDM_ATTESTATION_UNAVAILABLEThe station could not run SPDM attestation for one or more chips: the PCIe MCTP tunnel could not be served or reached, or the verifier could not be launched or its output written. The affected chips were not judged.S4 TRIAGEQ9 ESCALATEFix the station, proxy deployment, or suite configuration; do NOT route the unit to rework.SoftwareL10.HAR.HARNESSSpdmAttestMultiChipTestCaseL10 Test—supercomputing-swharness 2026.260
TH-FW-0040-S2Q9438894632v10.4Ulysses KaoSOHU_DEBUG_KEY_REVOCATION_FAILEDThe root of trust refused or did not apply the debug signing-key revocation, or the revoked mask read back after reset does not cover every debug slot.S2 ISOLATEQ9 ESCALATECapture logs and isolate the unit; do not continue the suite on this code. Attach the per-test log and suite URL; route to FA; open Jira.SecurityL10.FW.SOHURevokeSohuDebugKeysL10 Test—supercomputing-swharness 2026.265
TH-HAR-0001-S4Q0390070273v10.3Ulysses KaoTEST_TIMEOUTThe test exceeded its configured timeout and was terminated before producing a verdict (ABORTED disposition).S4 TRIAGEQ0 NO_ACTRerun the affected subset once to check reproducibility. Route to engineering triage with the per-test log and timeout configuration.CATEGORY_SOFTWAREL10.HAR.HARNESS—L10 Test—supercomputing-swharness 2026.226
TH-HAR-0002-S5Q9358154242v10.3Ulysses KaoTEST_ARGS_INVALIDA test case was invoked with invalid or unsupported arguments and rejected the run before touching the DUT.S5 CONFIGQ9 ESCALATEFix the suite configuration for this test; do NOT route the unit to rework.CATEGORY_CONFIGL10.HAR.HARNESSCpuStress
MemoryStressNg
MemoryStress
IoStress
SohuSnapTestCase
ExecBinaryTestCase
L10 Test—supercomputing-swharness 2026.226
TH-HAR-0003-S5Q9358154243v10.3Ulysses KaoTEST_DEPENDENCY_UNAVAILABLETool/binary/data file the test depends on is missing on the test system (test-system ERROR — excluded from module yield)S5 CONFIGQ9 ESCALATEFix the station deployment / harness package; do NOT route the unit to rework.CATEGORY_CONFIGL10.HAR.HARNESSCpuStress
MemoryStressNg
MemoryStress
IoStress
LoopbackTopologyTest
NetworkBwRdmaTest
ModelRegistryNfsMountTestCase
StageModelRegistryToShmTestCase
SohuServerBmcFirmwareUpdate
SohuServerBiosUpdate
PsuFirmwareUpdate
CpldFirmwareUpdate
L10VBBUpdate
InstallLinuxPackagesTestCase
UpdatePlxDaemonFirmwareVersion
BroadcomUpdateFwAndConfigure
UpdateSohuBootloader
MultiChipSohuHotReloadFirmwareUpdateTestCase
ExecBinaryTestCase
L10 Test—supercomputing-swharness 2026.226
TH-HAR-0004-S4Q9357105668v10.3Ulysses KaoNESTED_SUITE_ORCHESTRATION_FAILEDNested suite failed to launch or complete orchestration (child test failures carry their own codes)S4 TRIAGEQ9 ESCALATECheck the suite config and resources for the nested wrapper. Route to test-infra; do NOT route the unit to rework or FA.CATEGORY_CONFIGL10.HAR.HARNESSRunInStressL10 Test—supercomputing-swharness 2026.226
TH-HAR-0005-S4Q6390463493v10.3Ulysses KaoTEST_TOOL_EXECUTION_FAILEDA test-owned command or binary failed to execute and did not produce a domain-specific DUT verdict.S4 TRIAGEQ6 RETRYFix the station, image, or suite configuration; do NOT route the unit to rework.SoftwareL10.HAR.HARNESSIoStress
ExecBinaryTestCase
CpldDiagnosticsRemoteTestCase
L10 Test—supercomputing-swharness 2026.226
TH-HAR-0006-S4Q9390660102v10.3Ulysses KaoTEST_METRICS_PARSE_FAILEDA test tool completed without complete, parseable metrics needed to determine the result.S4 TRIAGEQ9 ESCALATEFix the station, image, or suite configuration; do NOT route the unit to rework.SoftwareL10.HAR.HARNESSIoStress
ExecBinaryTestCase
L10 Test—supercomputing-swharness 2026.226
TH-HAR-0007-S4Q9390660103v10.3Ulysses KaoTEST_OUTPUT_UNAVAILABLEExpected test output, state, or result artifacts were not produced.S4 TRIAGEQ9 ESCALATEFix the station, image, or suite configuration; do NOT route the unit to rework.SoftwareL10.HAR.HARNESSStoreSystemLogStates
CheckSystemLogStates
ExecBinaryTestCase
L10 Test—supercomputing-swharness 2026.226
TH-HAR-0008-S5Q9358154248v10.3Ulysses KaoTEST_PRECONDITION_NOT_META required test precondition was not satisfied, so the test did not exercise the DUT as intended.S5 CONFIGQ9 ESCALATEFix the station, image, or suite configuration; do NOT route the unit to rework.ConfigL10.HAR.HARNESSRunInStress
IoStress
NetworkBwRdmaTest
L10 Test—supercomputing-swharness 2026.226
TH-HAR-0009-S4Q9390660105v10.3Ulysses KaoTEST_CLEANUP_FAILEDTest cleanup failed and may have left processes, mounts, namespaces, files, or device state behind.S4 TRIAGEQ9 ESCALATEFix the station, image, or suite configuration; do NOT route the unit to rework.SoftwareL10.HAR.HARNESSLoopbackTopologyTest
NetworkBwRdmaTest
FreeModelRegistryFromShmTestCase
FreeWeightsTestCase
L10 Test—supercomputing-swharness 2026.226
TH-HAR-0010-S4Q9390660106v10.3Ulysses KaoSYSTEM_LOG_SNAPSHOT_FAILEDThe pre-test system-log baseline could not be captured.S4 TRIAGEQ9 ESCALATEFix the station, image, or suite configuration; do NOT route the unit to rework.SoftwareL10.HAR.HARNESSStoreSystemLogStatesL10 Test—supercomputing-swharness 2026.226
TH-HAR-0011-S4Q9390660107v10.3Ulysses KaoSYSTEM_LOG_COMPARE_FAILEDSystem-log state could not be queried, parsed, or compared with the stored baseline.S4 TRIAGEQ9 ESCALATEFix the station, image, or suite configuration; do NOT route the unit to rework.SoftwareL10.HAR.HARNESSCheckSystemLogStatesL10 Test—supercomputing-swharness 2026.226
TH-HAR-9998-S3Q0271591182v10.3Ulysses KaoTEST_FAILED_UNCLASSIFIEDA test returned TestFailedError without a specific TH identity; this catch-all is a taxonomy-health failure and must be replaced by a specific code.S3 UNKNOWNQ0 NO_ACTFollow the failing test case's own documentation/SOP. Open a taxonomy-gap ticket to allocate a specific code for this failure mode.CATEGORY_NONEL10.HAR.HARNESS—L10 Test—supercomputing-swharness 2026.226
TH-HAR-9999-S3Q9389621519v10.3Ulysses KaoUNHANDLED_EXCEPTIONAn unhandled exception escaped the test and was wrapped by the harness; the traceback is retained in the per-test log (ERROR disposition).S3 UNKNOWNQ9 ESCALATERoute to the owning test/SW engineer with the traceback; do NOT route the unit to rework or FA.CATEGORY_SOFTWAREL10.HAR.HARNESS—L10 Test—supercomputing-swharness 2026.226
TH-HBM-0006-S2Q9321454086v10.3Ulysses KaoHBM_LANE_REPAIR_FAILEDHBM lane repair failed - no passing repair foundS2 ISOLATEQ9 ESCALATEEscalate to Etched with the lane-repair map; the stack is unrepairable, so screen the module out rather than reworking it.CATEGORY_MEMORYL10.HBM.HBMSohuLaneRepairMultiChipTestCaseL10 Test—supercomputing-swharness 2026.226
TH-HBM-0009-S2Q9321454089v10.4Ulysses KaoHBM_PMBIST_FAILEDHBM PMBIST failureS2 ISOLATEQ9 ESCALATERerun up to 3 times (stack in affected_instances); isolate. Isolate the module after retry exhaustion; escalate to Etched with the captured evidence.MemoryL10.HBM.HBMSohuPmbistMultiChipTestCaseL10 Test—supercomputing-swharness 2026.226
TH-HBM-0010-S2Q6321257482v10.4Ulysses KaoHBM_MTC_STRESS_FAILEDHBM MTC stress test failureS2 ISOLATEQ6 RETRYRerun up to 3 times (stack+pseudo-channel in affected_instances); isolate. Isolate the module after retry exhaustion; escalate to Etched with the captured evidence.MemoryL10.HBM.HBMSohuMtcStressMultiChipTestCaseL10 Test—supercomputing-swharness 2026.226
TH-HBM-0011-S2Q9321454091v10.4Ulysses KaoHBM_DMA_BANDWIDTH_BELOW_THRESHOLDPCIe-to-HBM read or write throughput on the side under test did not reach the configured min_bandwidth_gb_s floor.S2 ISOLATEQ9 ESCALATEEscalate to Etched with the measured bandwidth, the side tested, and the configured threshold.MemoryL10.HBM.HBMSohuDmaMultiChipTestCaseL10 Test—supercomputing-swharness 2026.226
TH-HBM-0012-S2Q9455671820v10.4Ulysses KaoHBM_DEVICE_ID_MISMATCHHBM device ID read failure or mismatchS2 ISOLATEQ9 ESCALATEEscalate to Etched with the failing stack id and the reported HBM system info.DataL10.HBM.HBMSohuHbmDeviceIdMultiChipTestCaseL10 Test—supercomputing-swharness 2026.226
TH-HBM-0013-S4Q9323551245v10.4Ulysses KaoHBM_LANE_REPAIR_INCONCLUSIVEHBM lane repair sweep did not complete, so repairability was never establishedS4 TRIAGEQ9 ESCALATEFix the station, image, or suite configuration; do NOT route the unit to rework.MemoryL10.HBM.HBMSohuLaneRepairMultiChipTestCaseL10 Test—supercomputing-swharness 2026.226
TH-INFRA-0001-S4Q9424214529v10.3Ulysses KaoRACKSIM_UNAVAILABLEThe configured racksim service or simulated server endpoint is unavailable.S4 TRIAGEQ9 ESCALATEFix the station, image, or suite configuration; do NOT route the unit to rework.ResourceL10.INFRA.STATIONRunInStress
ExecBinaryTestCase
L10 Test—supercomputing-swharness 2026.226
TH-INFRA-0002-S4Q9289996802v10.3Ulysses KaoREMOTE_EXECUTION_TRANSPORT_FAILEDThe infrastructure transport used to execute a remote L10 operation failed before a DUT verdict was obtained.S4 TRIAGEQ9 ESCALATEFix the station, image, or suite configuration; do NOT route the unit to rework.NetworkL10.INFRA.STATIONCpldDiagnosticsRemoteTestCase
ExecBinaryTestCase
L10 Test—supercomputing-swharness 2026.226
TH-INFRA-0003-S4Q9289996803v10.3Ulysses KaoINFRA_NETWORK_PATH_UNAVAILABLEA required station-side network path, route, or service endpoint is unavailable.S4 TRIAGEQ9 ESCALATEFix the station, image, or suite configuration; do NOT route the unit to rework.NetworkL10.INFRA.STATIONModelRegistryNfsMountTestCase
BmcConnectivityCheck
L10 Test—supercomputing-swharness 2026.226
TH-INFRA-0004-S4Q9424214532v10.3Ulysses KaoTEST_RESOURCE_EXHAUSTEDA station-side resource limit prevented the L10 test from running or completing.S4 TRIAGEQ9 ESCALATEFix the station, image, or suite configuration; do NOT route the unit to rework.ResourceL10.INFRA.STATIONStageModelRegistryToShmTestCase
StageWeightsTestCase
RunInStress
L10 Test—supercomputing-swharness 2026.226
TH-MEM-0001-S4Q9390660097v10.3Ulysses KaoMEMORY_INVENTORY_QUERY_FAILEDThe host memory inventory command failed; no DIMM verdict is available.S4 TRIAGEQ9 ESCALATEFix the station, image, or suite configuration; do NOT route the unit to rework.SoftwareL10.MEM.HOST_DIMMCheckMemoryL10 Test—supercomputing-swharness 2026.226
TH-MEM-0002-S4Q9390660098v10.3Ulysses KaoMEMORY_INVENTORY_OUTPUT_INVALIDThe host memory inventory output was malformed or could not be parsed.S4 TRIAGEQ9 ESCALATEFix the station, image, or suite configuration; do NOT route the unit to rework.SoftwareL10.MEM.HOST_DIMMCheckMemoryL10 Test—supercomputing-swharness 2026.226
TH-MEM-0003-S2Q9321454083v10.3Ulysses KaoNO_DIMMS_DETECTEDNo populated DIMMs were detected although the L10 BOM requires host memory.S2 ISOLATEQ9 ESCALATECapture logs and isolate the unit; do not continue the L10 suite on this code. Attach the per-test log and suite URL; route to FA; open Jira.MemoryL10.MEM.HOST_DIMMCheckMemoryL10 Test—supercomputing-swharness 2026.226
TH-MEM-0004-S2Q9321454084v10.3Ulysses KaoDIMM_COUNT_MISMATCHThe number of populated DIMMs does not match the expected L10 BOM.S2 ISOLATEQ9 ESCALATECapture logs and isolate the unit; do not continue the L10 suite on this code. Attach the per-test log and suite URL; route to FA; open Jira.MemoryL10.MEM.HOST_DIMMCheckMemoryL10 Test—supercomputing-swharness 2026.226
TH-MEM-0005-S2Q9455671813v10.3Ulysses KaoDIMM_IDENTITY_OR_CAPACITY_MISMATCHA DIMM manufacturer, part number, serial number, location, or capacity does not match the expected BOM.S2 ISOLATEQ9 ESCALATECapture logs and isolate the unit; do not continue the L10 suite on this code. Attach the per-test log and suite URL; route to FA; open Jira.DataL10.MEM.HOST_DIMMCheckMemoryL10 Test—supercomputing-swharness 2026.226
TH-MEM-0006-S4Q9357105670v10.3Ulysses KaoMIXED_DIMM_CONFIGURATIONThe installed DIMMs are not homogeneous where the platform configuration requires matching parts and capacities.S4 TRIAGEQ9 ESCALATECapture logs and isolate the unit; do not continue the L10 suite on this code. Attach the per-test log and suite URL; route to FA; open Jira.ConfigL10.MEM.HOST_DIMMCheckMemoryL10 Test—supercomputing-swharness 2026.226
TH-MEM-0007-S2Q6321257479v10.3Ulysses KaoMEMORY_STRESS_FAILEDThe host memory stress workload reported data errors, verification failures, or a workload-failure exit status.S2 ISOLATEQ6 RETRYRetry the affected L10 subset once and capture logs from the failing run. If persistent, isolate the unit; attach logs; route to FA; open Jira.MemoryL10.MEM.HOST_DIMMMemoryStressNg
MemoryStress
L10 Test—supercomputing-swharness 2026.226
TH-MEM-0008-S4Q9390660104v10.3Ulysses KaoMEMORY_STRESS_METRICS_INVALIDThe memory stress tool completed without usable result statistics or produced malformed metrics, so the verdict is inconclusive.S4 TRIAGEQ9 ESCALATEFix the station, image, or suite configuration; do NOT route the unit to rework.SoftwareL10.MEM.HOST_DIMMMemoryStressNg
MemoryStress
L10 Test—supercomputing-swharness 2026.226
TH-MEM-0009-S5Q9358154249v10.3Ulysses KaoNUMA_TOPOLOGY_PRECONDITION_NOT_METThe host NUMA/SNC topology does not provide the nodes required by the configured cross-NUMA I/O stress.S5 CONFIGQ9 ESCALATEFix the station, image, or suite configuration; do NOT route the unit to rework.ConfigL10.MEM.HOST_DIMMIoStressL10 Test—supercomputing-swharness 2026.226
TH-MEM-0010-S2Q6321257482v10.3Ulysses KaoCROSS_NUMA_MEMORY_STRESS_FAILEDThe cross-NUMA stream or memory-transfer workload failed its execution or acceptance criteria.S2 ISOLATEQ6 RETRYRetry the affected L10 subset once and capture logs from the failing run. If persistent, isolate the unit; attach logs; route to FA; open Jira.MemoryL10.MEM.HOST_DIMMIoStressL10 Test—supercomputing-swharness 2026.226
TH-MEZZ-0004-S2Q6371589124v10.4Ulysses KaoMEZZ_CPLD_ACCESS_FAILEDMezz/eval CPLD register access or write failureS2 ISOLATEQ6 RETRYRetest the affected test once. Escalate to Etched if the failure repeats.HardwareL10.MEZZ.CPLDCpldDiagnosticsRemoteTestCaseL10 Test—supercomputing-swharness 2026.226
TH-NIC-0001-S5Q9358154241v10.3Ulysses KaoNIC_EXPECTED_CONFIG_UNAVAILABLEThe expected NIC/BOM/network configuration could not be loaded; no NIC verdict is available.S5 CONFIGQ9 ESCALATEFix the station, image, or suite configuration; do NOT route the unit to rework.ConfigL10.NIC.NICCheckNic
CheckLomNicMac
LoopbackTopologyTest
NetworkBwRdmaTest
CheckNicAsicRails
L10 Test—supercomputing-swharness 2026.226
TH-NIC-0002-S4Q9390660098v10.3Ulysses KaoNIC_INVENTORY_QUERY_FAILEDNIC inventory or interface discovery failed.S4 TRIAGEQ9 ESCALATEFix the station, image, or suite configuration; do NOT route the unit to rework.SoftwareL10.NIC.NICCheckNic
CheckLomNicMac
LoopbackTopologyTest
NetworkBwRdmaTest
L10 Test—supercomputing-swharness 2026.226
TH-NIC-0003-S4Q9390660099v10.3Ulysses KaoNIC_DISCOVERY_SERVICE_UNAVAILABLEThe NIC discovery/netd service or its Unix-domain socket was not ready or reachable.S4 TRIAGEQ9 ESCALATEFix the station, image, or suite configuration; do NOT route the unit to rework.SoftwareL10.NIC.NICCheckNic
CheckInterfaceLinkStatus
CheckNetdReadiness
L10 Test—supercomputing-swharness 2026.226
TH-NIC-0004-S2Q9287899652v10.3Ulysses KaoNIC_COUNT_MISMATCHThe discovered NIC count does not match the expected L10 BOM.S2 ISOLATEQ9 ESCALATECapture logs and isolate the unit; do not continue the L10 suite on this code. Attach the per-test log and suite URL; route to FA; open Jira.NetworkL10.NIC.NICCheckNicL10 Test—supercomputing-swharness 2026.226
TH-NIC-0005-S2Q9455671813v10.3Ulysses KaoNIC_IDENTITY_MISMATCHA NIC vendor, device, name, speed capability, or expected grouping does not match configuration.S2 ISOLATEQ9 ESCALATECapture logs and isolate the unit; do not continue the L10 suite on this code. Attach the per-test log and suite URL; route to FA; open Jira.DataL10.NIC.NICCheckNicL10 Test—supercomputing-swharness 2026.226
TH-NIC-0006-S4Q9457768966v10.3Ulysses KaoNIC_DUPLICATE_PCI_ADDRESSMultiple NIC records resolve to the same PCI address.S4 TRIAGEQ9 ESCALATECapture logs and isolate the unit; do not continue the L10 suite on this code. Attach the per-test log and suite URL; route to FA; open Jira.DataL10.NIC.NICCheckNicL10 Test—supercomputing-swharness 2026.226
TH-NIC-0007-S2Q9287899655v10.3Ulysses KaoUNEXPECTED_NIC_DETECTEDA NIC that is not present in the expected L10 configuration was discovered.S2 ISOLATEQ9 ESCALATECapture logs and isolate the unit; do not continue the L10 suite on this code. Attach the per-test log and suite URL; route to FA; open Jira.NetworkL10.NIC.NICCheckNicL10 Test—supercomputing-swharness 2026.226
TH-NIC-0008-S2Q9287899656v10.3Ulysses KaoLOM_NIC_NOT_DETECTEDThe configured LAN-on-motherboard interface was not found.S2 ISOLATEQ9 ESCALATECapture logs and isolate the unit; do not continue the L10 suite on this code. Attach the per-test log and suite URL; route to FA; open Jira.NetworkL10.NIC.LOMCheckLomNicMacL10 Test—supercomputing-swharness 2026.226
TH-NIC-0009-S2Q9455671817v10.3Ulysses KaoLOM_MAC_ADDRESS_MISMATCHThe LAN-on-motherboard MAC address does not match the expected service/BOM value.S2 ISOLATEQ9 ESCALATECapture logs and isolate the unit; do not continue the L10 suite on this code. Attach the per-test log and suite URL; route to FA; open Jira.DataL10.NIC.LOMCheckLomNicMacL10 Test—supercomputing-swharness 2026.226
TH-NIC-0010-S4Q9390660106v10.3Ulysses KaoNIC_DRIVER_QUERY_FAILEDThe installed NIC driver or firmware version could not be queried.S4 TRIAGEQ9 ESCALATEFix the station, image, or suite configuration; do NOT route the unit to rework.SoftwareL10.NIC.NICCheckBroadcomDriversL10 Test—supercomputing-swharness 2026.226
TH-NIC-0011-S5Q9358154251v10.3Ulysses KaoNIC_DRIVER_VERSION_MISMATCHThe installed NIC kernel driver does not match the required L10 release.S5 CONFIGQ9 ESCALATECapture logs and isolate the unit; do not continue the L10 suite on this code. Attach the per-test log and suite URL; route to FA; open Jira.ConfigL10.NIC.NICCheckBroadcomDriversL10 Test—supercomputing-swharness 2026.226
TH-NIC-0012-S5Q9358154252v10.3Ulysses KaoNIC_FIRMWARE_VERSION_MISMATCHThe installed NIC firmware does not match the required L10 release.S5 CONFIGQ9 ESCALATECapture logs and isolate the unit; do not continue the L10 suite on this code. Attach the per-test log and suite URL; route to FA; open Jira.ConfigL10.NIC.NICCheckBroadcomDriversL10 Test—supercomputing-swharness 2026.226
TH-NIC-0013-S4Q9390660109v10.3Ulysses KaoNIC_VERSION_OUTPUT_INVALIDNIC driver/firmware version output was incomplete or could not be parsed.S4 TRIAGEQ9 ESCALATEFix the station, image, or suite configuration; do NOT route the unit to rework.SoftwareL10.NIC.NICCheckBroadcomDriversL10 Test—supercomputing-swharness 2026.226
TH-NIC-0014-S2Q6287703054v10.3Ulysses KaoNIC_INTERFACE_LINK_DOWNA required NIC interface has no carrier or is not operationally up.S2 ISOLATEQ6 RETRYRetry the affected L10 subset once and capture logs from the failing run. If persistent, isolate the unit; attach logs; route to FA; open Jira.NetworkL10.NIC.NICCheckInterfaceLinkStatus
LoopbackTopologyTest
L10 Test—supercomputing-swharness 2026.226
TH-NIC-0015-S4Q9390660111v10.3Ulysses KaoNETD_NOT_READYnetd did not reach its ready state within the configured wait interval.S4 TRIAGEQ9 ESCALATEFix the station, image, or suite configuration; do NOT route the unit to rework.SoftwareL10.NIC.NICCheckNetdReadinessL10 Test—supercomputing-swharness 2026.226
TH-NIC-0016-S5Q9358154256v10.3Ulysses KaoNETD_ACTIVE_SLAVE_MISMATCHThe active bond slave reported by netd is not the configured expected interface.S5 CONFIGQ9 ESCALATECapture logs and isolate the unit; do not continue the L10 suite on this code. Attach the per-test log and suite URL; route to FA; open Jira.ConfigL10.NIC.NICCheckNetdReadinessL10 Test—supercomputing-swharness 2026.226
TH-NIC-0017-S2Q9287899665v10.3Ulysses KaoLOOPBACK_GROUP_COUNT_MISMATCHA configured loopback NIC group does not contain the expected number of interfaces.S2 ISOLATEQ9 ESCALATECapture logs and isolate the unit; do not continue the L10 suite on this code. Attach the per-test log and suite URL; route to FA; open Jira.NetworkL10.NIC.NICLoopbackTopologyTest
NetworkBwRdmaTest
L10 Test—supercomputing-swharness 2026.226
TH-NIC-0018-S5Q9358154258v10.3Ulysses KaoLOOPBACK_TOPOLOGY_INDEX_INVALIDA configured loopback client/server index is outside the discovered NIC group.S5 CONFIGQ9 ESCALATEFix the station, image, or suite configuration; do NOT route the unit to rework.ConfigL10.NIC.NICLoopbackTopologyTest
NetworkBwRdmaTest
L10 Test—supercomputing-swharness 2026.226
TH-NIC-0019-S2Q9287899667v10.3Ulysses KaoRDMA_DEVICE_UNAVAILABLEA required interface has no RDMA device binding or the configured group has no RDMA-capable interface.S2 ISOLATEQ9 ESCALATECapture logs and isolate the unit; do not continue the L10 suite on this code. Attach the per-test log and suite URL; route to FA; open Jira.NetworkL10.NIC.NICLoopbackTopologyTest
NetworkBwRdmaTest
L10 Test—supercomputing-swharness 2026.226
TH-NIC-0020-S4Q9390660116v10.3Ulysses KaoLOOPBACK_PAIR_CONFIGURATION_FAILEDThe test could not configure the loopback pair IP, MTU, namespace, neighbor, or interface state.S4 TRIAGEQ9 ESCALATEFix the station, image, or suite configuration; do NOT route the unit to rework.SoftwareL10.NIC.NICLoopbackTopologyTest
NetworkBwRdmaTest
L10 Test—supercomputing-swharness 2026.226
TH-NIC-0021-S4Q9289996821v10.3Ulysses KaoROCE_GID_UNAVAILABLEA required IPv4 RoCE v2 GID could not be found for one or both interfaces in the pair.S4 TRIAGEQ9 ESCALATEFix the station, image, or suite configuration; do NOT route the unit to rework.NetworkL10.NIC.NICLoopbackTopologyTest
NetworkBwRdmaTest
L10 Test—supercomputing-swharness 2026.226
TH-NIC-0022-S2Q6287703062v10.3Ulysses KaoLOOPBACK_PROBE_FAILEDThe short RDMA loopback probe failed to establish traffic or returned a workload failure.S2 ISOLATEQ6 RETRYRetry the affected L10 subset once and capture logs from the failing run. If persistent, isolate the unit; attach logs; route to FA; open Jira.NetworkL10.NIC.NICLoopbackTopologyTestL10 Test—supercomputing-swharness 2026.226
TH-NIC-0023-S5Q9358154263v10.3Ulysses KaoNO_RDMA_PAIRS_TO_TESTNo valid RDMA-capable client/server pair remained after discovery and topology validation.S5 CONFIGQ9 ESCALATEFix the station, image, or suite configuration; do NOT route the unit to rework.ConfigL10.NIC.NICNetworkBwRdmaTestL10 Test—supercomputing-swharness 2026.226
TH-NIC-0024-S4Q9390660120v10.3Ulysses KaoRDMA_SERVER_START_FAILEDThe ib_write_bw server process could not be started for an RDMA pair.S4 TRIAGEQ9 ESCALATEFix the station, image, or suite configuration; do NOT route the unit to rework.SoftwareL10.NIC.NICNetworkBwRdmaTestL10 Test—supercomputing-swharness 2026.226
TH-NIC-0025-S2Q6287703065v10.3Ulysses KaoRDMA_CLIENT_EXECUTION_FAILEDThe ib_write_bw client timed out or returned a non-zero status for an RDMA pair.S2 ISOLATEQ6 RETRYRetry the affected L10 subset once and capture logs from the failing run. If persistent, isolate the unit; attach logs; route to FA; open Jira.NetworkL10.NIC.NICNetworkBwRdmaTestL10 Test—supercomputing-swharness 2026.226
TH-NIC-0026-S4Q9390660122v10.3Ulysses KaoRDMA_BANDWIDTH_OUTPUT_INVALIDThe RDMA bandwidth tool did not emit a parseable average-bandwidth result.S4 TRIAGEQ9 ESCALATEFix the station, image, or suite configuration; do NOT route the unit to rework.SoftwareL10.NIC.NICNetworkBwRdmaTestL10 Test—supercomputing-swharness 2026.226
TH-NIC-0027-S2Q9287899675v10.3Ulysses KaoRDMA_BANDWIDTH_BELOW_THRESHOLDMeasured RDMA bandwidth for a configured pair is below the configured percentage of expected line rate.S2 ISOLATEQ9 ESCALATECapture logs and isolate the unit; do not continue the L10 suite on this code. Attach the per-test log and suite URL; route to FA; open Jira.NetworkL10.NIC.NICNetworkBwRdmaTestL10 Test—supercomputing-swharness 2026.226
TH-NIC-0028-S5Q9358154268v10.3Ulysses KaoNIC_RAIL_CONFIG_UNAVAILABLEThe expected NIC ASIC rail limits could not be loaded from product configuration.S5 CONFIGQ9 ESCALATEFix the station, image, or suite configuration; do NOT route the unit to rework.ConfigL10.NIC.ASIC_RAILSCheckNicAsicRailsL10 Test—supercomputing-swharness 2026.226
TH-NIC-0029-S4Q9373882909v10.3Ulysses KaoNIC_RAIL_READING_UNAVAILABLEA required NIC ASIC voltage-rail reading is unavailable or reported as not applicable.S4 TRIAGEQ9 ESCALATEFix the station, image, or suite configuration; do NOT route the unit to rework.HardwareL10.NIC.ASIC_RAILSCheckNicAsicRailsL10 Test—supercomputing-swharness 2026.226
TH-NIC-0030-S2Q9371785758v10.3Ulysses KaoNIC_RAIL_OUT_OF_RANGEA NIC ASIC voltage rail is below its configured minimum or above its configured maximum.S2 ISOLATEQ9 ESCALATECapture logs and isolate the unit; do not continue the L10 suite on this code. Attach the per-test log and suite URL; route to FA; open Jira.HardwareL10.NIC.ASIC_RAILSCheckNicAsicRailsL10 Test—supercomputing-swharness 2026.226
TH-NIC-0031-S4Q9357105695v10.3Ulysses KaoNIC_FIRMWARE_UPDATE_FAILEDThe Broadcom NIC firmware update command failed.S4 TRIAGEQ9 ESCALATECapture logs and isolate the unit; do not continue the L10 suite on this code. Attach the per-test log and suite URL; route to FA; open Jira.ConfigL10.NIC.NICBroadcomUpdateFwAndConfigureL10 Test—supercomputing-swharness 2026.226
TH-NIC-0032-S4Q9357105696v10.3Ulysses KaoNIC_CONFIGURATION_APPLY_FAILEDRequired NIC port, driver, or firmware configuration could not be applied.S4 TRIAGEQ9 ESCALATECapture logs and isolate the unit; do not continue the L10 suite on this code. Attach the per-test log and suite URL; route to FA; open Jira.ConfigL10.NIC.NICBroadcomUpdateFwAndConfigureL10 Test—supercomputing-swharness 2026.226
TH-NIC-0033-S4Q9357105697v10.3Ulysses KaoNIC_POST_UPDATE_VERIFY_FAILEDNIC firmware or configuration did not match the requested state after update.S4 TRIAGEQ9 ESCALATECapture logs and isolate the unit; do not continue the L10 suite on this code. Attach the per-test log and suite URL; route to FA; open Jira.ConfigL10.NIC.NICBroadcomUpdateFwAndConfigureL10 Test—supercomputing-swharness 2026.226
TH-NIC-0034-S4Q9457768994v10.3Ulysses KaoNIC_MAC_ADDRESS_UNAVAILABLEA required interface MAC address could not be read while constructing a loopback/RDMA pair.S4 TRIAGEQ9 ESCALATEFix the station, image, or suite configuration; do NOT route the unit to rework.DataL10.NIC.NICLoopbackTopologyTest
NetworkBwRdmaTest
L10 Test—supercomputing-swharness 2026.226
TH-NIC-0035-S2Q6287703075v10.3Ulysses KaoNIC_LINK_RECOVERY_FAILEDA carrier-down interface did not recover after the configured link-speed/FEC recovery sequence.S2 ISOLATEQ6 RETRYRetry the affected L10 subset once and capture logs from the failing run. If persistent, isolate the unit; attach logs; route to FA; open Jira.NetworkL10.NIC.NICLoopbackTopologyTestL10 Test—supercomputing-swharness 2026.226
TH-NIC-0036-S4Q9289996836v10.4Ulysses KaoNIC_PORT_INTERFACE_MISSINGnetd reported a NIC port with no kernel interface name, so ethtool cannot read that port's module EEPROM and the cable there cannot be verified.S4 TRIAGEQ9 ESCALATECollect the suite/test logs and artifacts for this failure. Escalate to Etched engineer with the collected logs.NetworkL10.NIC.PORTCheckCableL10 Test—supercomputing-swharness 2026.224
TH-NIC-0037-S4Q9457768997v10.4Ulysses KaoCABLE_MODULE_INFO_INCOMPLETEA pluggable module was read but cannot be checked: netd gave its port no position identifier or one outside the known layout, or the module did not report every identity field the check requires.S4 TRIAGEQ9 ESCALATECollect the suite/test logs and artifacts for this failure. Escalate to Etched engineer with the collected logs.DataL10.NIC.CABLECheckCableL10 Test—supercomputing-swharness 2026.224
TH-NIC-0038-S2Q9287899686v10.4Ulysses KaoCABLE_MISSING_AT_POSITIONThe BOM declares a cable at a port position where none was found: no NIC reported that position, the port was pruned earlier, or the module read failed.S2 ISOLATEQ9 ESCALATEVerify the cable is installed and fully seated at the reported port position per the cabling SOP, then retest. Collect the suite/test logs and artifacts for this failure. Escalate to Etched engineer with the collected logs.NetworkL10.NIC.CABLECheckCableL10 Test—supercomputing-swharness 2026.224
TH-NIC-0039-S4Q9357105703v10.4Ulysses KaoNIC_PORT_POSITION_AMBIGUOUSMore than one module reported the same port position, so the check cannot tell which one is physically there and prunes all of them rather than guessing.S4 TRIAGEQ9 ESCALATECollect the suite/test logs and artifacts for this failure. Escalate to Etched engineer with the collected logs.ConfigL10.NIC.PORTCheckCableL10 Test—supercomputing-swharness 2026.224
TH-NIC-0040-S2Q9371785768v10.4Ulysses KaoCABLE_IDENTITY_MISMATCHA module's identity fields do not match the BOM entry for its port position: Vendor PN (including the entry's alternate part numbers), Vendor name, Identifier, Transmitter technology, or a shopfloor-declared Vendor SN.S2 ISOLATEQ9 ESCALATECompare the installed cable against the BOM part for this position and install the correct part, then retest. Collect the suite/test logs and artifacts for this failure. Escalate to Etched engineer with the collected logs.HardwareL10.NIC.CABLECheckCableL10 Test—supercomputing-swharness 2026.224
TH-NIC-0041-S2Q9371785769v10.4Ulysses KaoCABLE_UNEXPECTED_AT_POSITIONA module was found at a port position where the BOM declares no cable.S2 ISOLATEQ9 ESCALATERemove or relocate the cable at the reported position per the cabling SOP, then retest. Collect the suite/test logs and artifacts for this failure. Escalate to Etched engineer with the collected logs.HardwareL10.NIC.CABLECheckCableL10 Test—supercomputing-swharness 2026.224
TH-PCIE-0001-S2Q6371589121v10.3Ulysses KaoPCIE_LINK_STATE_MISMATCHPCIe link state mismatch (not L0 / Gen5 / x16)S2 ISOLATEQ6 RETRYRerun the PCIe subset up to 3 times; capture lspci and AER state before retry. Isolate the module after retry exhaustion; escalate to Etched with the captured evidence.CATEGORY_HARDWAREL10.PCIE.HOST_PCIECheckPcieTopologyL10 Test—supercomputing-swharness 2026.226
TH-PCIE-0003-S2Q9371785731v10.3Ulysses KaoPCIE_CSRAM_DMA_THROUGHPUT_BELOW_THRESHOLDPCIe->CSRAM DMA throughput below threshold (50GB/s)S2 ISOLATEQ9 ESCALATERerun the PCIe/DMA subset up to 3 times; reseat the module if failures persist. Capture lspci + AER state; isolate the module and route to triage.CATEGORY_HARDWAREL10.PCIE.HOST_PCIESohuDmaMultiChipTestCaseL10 Test—supercomputing-swharness 2026.226
TH-PCIE-0005-S2Q9371785733v10.3Ulysses KaoPCIE_HBM_DMA_THROUGHPUT_BELOW_THRESHOLDPCIe->HBM DMA throughput below threshold (16GB/s)S2 ISOLATEQ9 ESCALATERerun the DMA subset up to 3 times; reseat the module if failures persist. Capture lspci link state and throughput numbers; isolate the module and route to triage.CATEGORY_HARDWAREL10.PCIE.HOST_PCIESohuDmaMultiChipTestCaseL10 Test—supercomputing-swharness 2026.226
TH-PCIE-0008-S2Q6371589128v10.3Ulysses KaoSOHU_ENDPOINT_NOT_ENUMERATEDSohu endpoint not enumerated (absent from PCIe tree / RPC proxy)S2 ISOLATEQ6 RETRYEscalate to Etched.CATEGORY_HARDWAREL10.PCIE.HOST_PCIECheckPcieTopology
SohuVfioPingMultiChipTestCase
L10 Test—supercomputing-swharness 2026.226
TH-PCIE-0009-S5Q9358154249v10.3Ulysses KaoPCIE_EXPECTED_TOPOLOGY_UNAVAILABLEThe expected PCIe topology or device specification could not be loaded; no PCIe DUT verdict is available.S5 CONFIGQ9 ESCALATEFix the station, image, or suite configuration; do NOT route the unit to rework.ConfigL10.PCIE.HOST_PCIECheckPcieTopologyL10 Test—supercomputing-swharness 2026.226
TH-PCIE-0010-S4Q9390660106v10.3Ulysses KaoPCIE_INVENTORY_QUERY_FAILEDThe PCIe inventory command failed, so the test could not enumerate devices or links.S4 TRIAGEQ9 ESCALATEFix the station, image, or suite configuration; do NOT route the unit to rework.SoftwareL10.PCIE.HOST_PCIECheckPcieTopologyL10 Test—supercomputing-swharness 2026.226
TH-PCIE-0011-S4Q9390660107v10.3Ulysses KaoPCIE_INVENTORY_OUTPUT_INVALIDThe PCIe inventory output was empty, incomplete, or could not be parsed into a reliable topology.S4 TRIAGEQ9 ESCALATEFix the station, image, or suite configuration; do NOT route the unit to rework.SoftwareL10.PCIE.HOST_PCIECheckPcieTopologyL10 Test—supercomputing-swharness 2026.226
TH-PCIE-0012-S5Q9358154252v10.3Ulysses KaoPCIE_TOPOLOGY_SPEC_INVALIDThe configured PCIe topology contains invalid or conflicting device identifiers, counts, or topology indices.S5 CONFIGQ9 ESCALATEFix the station, image, or suite configuration; do NOT route the unit to rework.ConfigL10.PCIE.HOST_PCIECheckPcieTopologyL10 Test—supercomputing-swharness 2026.226
TH-PCIE-0013-S2Q6371589133v10.3Ulysses KaoPCIE_TOPOLOGY_MISMATCHThe discovered PCIe device count or parent/child topology does not match the expected server topology.S2 ISOLATEQ6 RETRYRetry the affected L10 subset once and capture logs from the failing run. If persistent, isolate the unit; attach logs; route to FA; open Jira.HardwareL10.PCIE.HOST_PCIECheckPcieTopologyL10 Test—supercomputing-swharness 2026.226
TH-PCIE-0014-S2Q9455671822v10.3Ulysses KaoPCIE_DEVICE_IDENTITY_MISMATCHA discovered PCIe device has an unexpected vendor ID, device ID, subsystem ID, or configured device name.S2 ISOLATEQ9 ESCALATECapture logs and isolate the unit; do not continue the L10 suite on this code. Attach the per-test log and suite URL; route to FA; open Jira.DataL10.PCIE.HOST_PCIECheckPcieTopologyL10 Test—supercomputing-swharness 2026.226
TH-PCIE-0015-S4Q9457768975v10.3Ulysses KaoPCIE_DUPLICATE_BDFTwo expected or discovered PCIe devices resolve to the same bus/device/function address.S4 TRIAGEQ9 ESCALATECapture logs and isolate the unit; do not continue the L10 suite on this code. Attach the per-test log and suite URL; route to FA; open Jira.DataL10.PCIE.HOST_PCIECheckPcieTopologyL10 Test—supercomputing-swharness 2026.226
TH-PCIE-0016-S4Q9390660112v10.3Ulysses KaoPLX_DAEMON_VERSION_QUERY_FAILEDThe PLX daemon firmware/version query failed or returned no usable switch information.S4 TRIAGEQ9 ESCALATEFix the station, image, or suite configuration; do NOT route the unit to rework.SoftwareL10.PCIE.PLX_SWITCHCheckPlxDaemonFirmwareVersionL10 Test—supercomputing-swharness 2026.226
TH-PCIE-0017-S5Q9358154257v10.3Ulysses KaoPLX_DAEMON_FIRMWARE_VERSION_MISMATCHThe PLX daemon or switch firmware version does not match the expected L10 release.S5 CONFIGQ9 ESCALATECapture logs and isolate the unit; do not continue the L10 suite on this code. Attach the per-test log and suite URL; route to FA; open Jira.ConfigL10.PCIE.PLX_SWITCHCheckPlxDaemonFirmwareVersionL10 Test—supercomputing-swharness 2026.226
TH-PCIE-0018-S4Q9357105682v10.3Ulysses KaoPLX_DAEMON_FIRMWARE_UPDATE_FAILEDThe PLX daemon firmware update or activation command failed.S4 TRIAGEQ9 ESCALATECapture logs and isolate the unit; do not continue the L10 suite on this code. Attach the per-test log and suite URL; route to FA; open Jira.ConfigL10.PCIE.PLX_SWITCHUpdatePlxDaemonFirmwareVersionL10 Test—supercomputing-swharness 2026.226
TH-PCIE-0019-S4Q9357105683v10.3Ulysses KaoPLX_DAEMON_POST_UPDATE_VERIFY_FAILEDPLX daemon firmware did not report the requested version after the update completed.S4 TRIAGEQ9 ESCALATECapture logs and isolate the unit; do not continue the L10 suite on this code. Attach the per-test log and suite URL; route to FA; open Jira.ConfigL10.PCIE.PLX_SWITCHUpdatePlxDaemonFirmwareVersionL10 Test—supercomputing-swharness 2026.226
TH-PCIE-0020-S2Q9455671828v10.4Ulysses KaoPCIE_HBM_DMA_DATA_MISMATCHPCIe->HBM DMA data integrity mismatchS2 ISOLATEQ9 ESCALATERerun the DMA subset up to 3 times with the reported seed. Preserve unit; attach output and failing block map; isolate the module and route to triage.DataL10.PCIE.HOST_PCIESohuDmaMultiChipTestCaseL10 Test—supercomputing-swharness 2026.226
TH-PWR-0007-S2Q9371785735v10.3Ulysses KaoUNEXPECTED_DVFS_RAMPDOWNUnexpected DVFS rampdown event during workloadS2 ISOLATEQ9 ESCALATECapture DVFS/power telemetry; rerun up to 3 times, then isolate. Isolate the module after retry exhaustion; escalate to Etched with the captured evidence.CATEGORY_HARDWAREL10.PWR.POWERSohuPowerVirusMultiChipTestCaseL10 Test—supercomputing-swharness 2026.226
TH-PWR-0009-S4Q9390660105v10.3Ulysses KaoBMC_POWER_CYCLE_COMMAND_FAILEDThe BMC power-cycle command returned a failure.S4 TRIAGEQ9 ESCALATEFix the station, image, or suite configuration; do NOT route the unit to rework.SoftwareL10.PWR.POWERBmcPowerCycleL10 Test—supercomputing-swharness 2026.226
TH-PWR-0010-S2Q9371785738v10.3Ulysses KaoHOST_DID_NOT_POWER_OFFThe host remained reachable after the BMC power-off step and did not enter the expected off state.S2 ISOLATEQ9 ESCALATECapture logs and isolate the unit; do not continue the L10 suite on this code. Attach the per-test log and suite URL; route to FA; open Jira.HardwareL10.PWR.POWERBmcPowerCycleL10 Test—supercomputing-swharness 2026.226
TH-PWR-0011-S2Q9371785739v10.3Ulysses KaoHOST_DID_NOT_RECOVER_AFTER_POWER_CYCLEThe host did not become reachable within the configured interval after BMC power-on.S2 ISOLATEQ9 ESCALATECapture logs and isolate the unit; do not continue the L10 suite on this code. Attach the per-test log and suite URL; route to FA; open Jira.HardwareL10.PWR.POWERBmcPowerCycleL10 Test—supercomputing-swharness 2026.226
TH-PWR-0012-S4Q9390660108v10.3Ulysses KaoHOST_REBOOT_COMMAND_FAILEDThe host reboot request failed before the reboot transition could be observed.S4 TRIAGEQ9 ESCALATEFix the station, image, or suite configuration; do NOT route the unit to rework.SoftwareL10.PWR.POWERSohuHostRebootTestCaseL10 Test—supercomputing-swharness 2026.226
TH-PWR-0013-S4Q9373882893v10.3Ulysses KaoHOST_REBOOT_NOT_OBSERVEDThe host never became unreachable after the reboot request, so the expected reboot transition was not observed.S4 TRIAGEQ9 ESCALATECapture logs and isolate the unit; do not continue the L10 suite on this code. Attach the per-test log and suite URL; route to FA; open Jira.HardwareL10.PWR.POWERSohuHostRebootTestCaseL10 Test—supercomputing-swharness 2026.226
TH-PWR-0014-S2Q9371785742v10.3Ulysses KaoHOST_DID_NOT_RECOVER_AFTER_REBOOTThe host did not return to a reachable and usable state within the configured reboot recovery interval.S2 ISOLATEQ9 ESCALATECapture logs and isolate the unit; do not continue the L10 suite on this code. Attach the per-test log and suite URL; route to FA; open Jira.HardwareL10.PWR.POWERSohuHostRebootTestCaseL10 Test—supercomputing-swharness 2026.226
TH-SOHU-0002-S2Q9371785730v10.3Ulysses KaoSOHU_NOT_PINGABLESohu not pingable / no response from firmwareS2 ISOLATEQ9 ESCALATEEscalate to Etched with the unresponsive device index and the UART log.CATEGORY_HARDWAREL10.SOHU.SOHU_CHIPSohuPingTestCase
SohuVfioPingMultiChipTestCase
SohuFlrMultiChipTestCase
L10 Test—supercomputing-swharness 2026.226
TH-SOHU-0028-S4Q9390660124v10.3Ulysses KaoSOHU_WORKLOAD_BINARY_FAILEDMTT binary exited non-zero for a reason the harness cannot determineS4 TRIAGEQ9 ESCALATECapture logs and isolate the unit; do not continue the L10 suite on this code. Attach the per-test log and suite URL; route to FA; open Jira.SoftwareL10.SOHU.SOHU_CHIPSohuMlpTp8TestCase
SohuLlama70bForwardIteratedTestCase
SohuLlama70bHp8ForwardIteratedTestCase
SohuLlamaHp2Up4CachedInferenceMaxTestCase
SohuLlamaHp2Up4NospecInferenceMaxTestCase
SohuLlamaHp8CachedInferenceMaxTestCase
Llama8bFp8Tp1SmokeTestCase
L10 Test—supercomputing-swharness 2026.226
TH-SOHU-0029-S2Q9321454109v10.4Ulysses KaoSOHU_SRAM_TEST_FAILEDOn-chip SRAM test failure (stuck bits / readback mismatch)S2 ISOLATEQ9 ESCALATERerun the SRAM subset once (SRAM names in affected_instances). Isolate module; attach failing SRAM list and March C+ log; route to FA; open Jira.MemoryL10.SOHU.SOHU_CHIPSohuSramMemoryMultiChipTestCaseL10 Test—supercomputing-swharness 2026.226
TH-SOHU-0030-S2Q9371785758v10.4Ulysses KaoSOHU_WORKLOAD_TIMEOUTWorkload hang / operation timeoutS2 ISOLATEQ9 ESCALATECapture state before recovery and retry up to three times. Isolate the module after retry exhaustion.HardwareL10.SOHU.SOHU_CHIPSohuMlpTp8TestCase
SohuLlama70bForwardIteratedTestCase
SohuLlama70bHp8ForwardIteratedTestCase
SohuLlamaHp2Up4CachedInferenceMaxTestCase
SohuLlamaHp2Up4NospecInferenceMaxTestCase
SohuLlamaHp8CachedInferenceMaxTestCase
Llama8bFp8Tp1SmokeTestCase
SohuPowerVirusMultiChipTestCase
L10 Test—supercomputing-swharness 2026.226
TH-SOHU-0031-S2Q9455671839v10.4Ulysses KaoSOHU_WEIGHT_LOAD_MISMATCHWeight load spot-check mismatchS2 ISOLATEQ9 ESCALATERerun up to 3 times; isolate (subset offsets in raw_data). Isolate the module after retry exhaustion; escalate to Etched with the captured evidence.DataL10.SOHU.SOHU_CHIPSohuLlama70bForwardIteratedTestCase
SohuLlama70bHp8ForwardIteratedTestCase
SohuLlamaHp2Up4CachedInferenceMaxTestCase
SohuLlamaHp2Up4NospecInferenceMaxTestCase
SohuLlamaHp8CachedInferenceMaxTestCase
Llama8bFp8Tp1SmokeTestCase
L10 Test—supercomputing-swharness 2026.226
TH-SOHU-0032-S2Q9371785760v10.4Ulysses KaoSOHU_INFERENCE_THROUGHPUT_BELOW_THRESHOLDSustained inference throughput on the million-token test did not reach 95% of the suite's expected_chip_tokens_per_second.S2 ISOLATEQ9 ESCALATEEscalate to Etched with the measured tokens/s, the configured expectation, and the DVFS/thermal telemetry.HardwareL10.SOHU.SOHU_CHIPSohuLlamaHp2Up4CachedInferenceMaxTestCase
SohuLlamaHp2Up4NospecInferenceMaxTestCase
SohuLlamaHp8CachedInferenceMaxTestCase
L10 Test—supercomputing-swharness 2026.226
TH-SOHU-0033-S2Q9371785761v10.4Ulysses KaoSOHU_INFERENCE_NUMERIC_MISMATCHEnd-to-end inference numeric mismatch vs referenceS2 ISOLATEQ9 ESCALATERetry up to three times. Isolate the module after retry exhaustion.HardwareL10.SOHU.SOHU_CHIPSohuMlpTp8TestCase
SohuLlama70bForwardIteratedTestCase
SohuLlama70bHp8ForwardIteratedTestCase
SohuLlamaHp2Up4CachedInferenceMaxTestCase
SohuLlamaHp2Up4NospecInferenceMaxTestCase
SohuLlamaHp8CachedInferenceMaxTestCase
Llama8bFp8Tp1SmokeTestCase
L10 Test—supercomputing-swharness 2026.226
TH-SOHU-0034-S2Q9371785762v10.4Ulysses KaoSOHU_FLR_FAILEDFLR failed / flr_timeout_s 5.0s / recovery_timeout_s 10.0s / not pingable between FLRsS2 ISOLATEQ9 ESCALATEEscalate to Etched with the failing iteration index, measured FLR durations, and post-reset link state.HardwareL10.SOHU.SOHU_CHIPSohuFlrMultiChipTestCaseL10 Test—supercomputing-swharness 2026.226
TH-SOHU-0035-S4Q9373882915v10.4Ulysses KaoSOHU_SNAPSHOT_CAPTURE_FAILEDChip state snapshot capture failedS4 TRIAGEQ9 ESCALATERerun up to 3 times. Escalate to Etched with the snapshot log.HardwareL10.SOHU.SOHU_CHIPSohuSnapTestCaseL10 Test—supercomputing-swharness 2026.226
TH-SOHU-0036-S2Q9371785764v10.4Ulysses KaoSOHU_VFIO_PING_LATENCY_EXCEEDEDVFIO ping responses received but none within the allowed latency (device pingable, latency out of spec)S2 ISOLATEQ9 ESCALATECapture logs and isolate the unit; do not continue the L10 suite on this code. Attach the per-test log and suite URL; route to FA; open Jira.HardwareL10.SOHU.SOHU_CHIPSohuVfioPingMultiChipTestCaseL10 Test—supercomputing-swharness 2026.226
TH-THM-0008-S4Q9357105672v10.3Ulysses KaoFAN_LOCATION_MISMATCHFan location identifiers read back from the BMC do not match the configured physical fan positions.S4 TRIAGEQ9 ESCALATECapture logs and isolate the unit; do not continue the L10 suite on this code. Attach the per-test log and suite URL; route to FA; open Jira.ConfigL10.THM.FANBmcCheckFanLocationL10 Test—supercomputing-swharness 2026.226
TH-THM-0009-S4Q9373882889v10.3Ulysses KaoFAN_PWM_SET_FAILEDThe requested fan PWM value could not be applied through the BMC control interface.S4 TRIAGEQ9 ESCALATECapture logs and isolate the unit; do not continue the L10 suite on this code. Attach the per-test log and suite URL; route to FA; open Jira.HardwareL10.THM.FANBmcCheckFanControlL10 Test—supercomputing-swharness 2026.226
TH-THM-0010-S2Q9371785738v10.3Ulysses KaoFAN_RPM_RESPONSE_OUT_OF_RANGEA fan RPM reading is outside the expected range or does not increase as required after a PWM change.S2 ISOLATEQ9 ESCALATECapture logs and isolate the unit; do not continue the L10 suite on this code. Attach the per-test log and suite URL; route to FA; open Jira.HardwareL10.THM.FANBmcCheckFanControlL10 Test—supercomputing-swharness 2026.226
TH-THM-0011-S4Q9373882891v10.3Ulysses KaoFAN_AUTOMATIC_MODE_RESTORE_FAILEDFan control could not be returned to automatic mode after the manual fan test.S4 TRIAGEQ9 ESCALATEFix the station, image, or suite configuration; do NOT route the unit to rework.HardwareL10.THM.FANBmcCheckFanControlL10 Test—supercomputing-swharness 2026.226
TH-THM-0012-S2Q6371589132v10.4Ulysses KaoTHERMAL_DIODE_READING_INVALIDThermal diode temperature reading out of the qualified range, reported invalid by the sensor, or an uncalibrated mezzanine diode reading below 0 C.S2 ISOLATEQ6 RETRYVerify thermal head contact and station ambient; rerun the thermal subset once (channel in affected_instances). Inspect mezzanine diode solder joints if an uncalibrated channel reads below 0 C. Isolate module; attach per-channel readings; route to FA; open Jira.HardwareL10.THM.THERMALSohuDtsMultiChipTestCaseL10 Test—supercomputing-swharness 2026.226
TH-THM-0013-S2Q6371589133v10.4Ulysses KaoDTS_SPREAD_EXCEEDEDThe peak-to-peak spread across usable Sohu DTS readings exceeded the configured deviation limit.S2 ISOLATEQ6 RETRYVerify thermal forcing head seating, rerun the DTS test up to 3 times. Reseat the thermal forcing head and reapply TIM per assembly SOP. Isolate the module after retry exhaustion; escalate to Etched with the per-sensor spread.HardwareL10.THM.THERMALSohuDtsMultiChipTestCaseL10 Test—supercomputing-swharness 2026.226
TH-THM-0014-S2Q6371589134v10.4Ulysses KaoCATASTROPHIC_THERMAL_TRIPCatastrophic trip event during stress workloadS2 ISOLATEQ6 RETRYCapture thermal telemetry before retry; isolate if repeated. Isolate the module after retry exhaustion; escalate to Etched with the captured evidence.HardwareL10.THM.THERMALSohuPowerVirusMultiChipTestCaseL10 Test—supercomputing-swharness 2026.226
TH-THM-0015-S4Q9373882895v10.4Ulysses KaoDTS_DEVIATION_UNDER_STRESSDTS peak-to-peak deviation under power virus out of boundsS4 TRIAGEQ9 ESCALATECheck TIM / thermal head seating; rerun; triage against the tentative bounds. Isolate the module after retry exhaustion; escalate to Etched with the captured evidence.HardwareL10.THM.THERMALSohuPowerVirusMultiChipTestCaseL10 Test—supercomputing-swharness 2026.226
TH-THM-0016-S2Q9371785744v10.4Ulysses KaoPEAK_DTS_TEMPERATURE_EXCEEDEDPeak DTS temperature under power virus exceeds expected maximumS2 ISOLATEQ9 ESCALATEVerify the unit completed the required 45-minute TIM baking process (updated from 15 minutes). If baked and still out of spec, escalate to Etched for FA.HardwareL10.THM.THERMALSohuPowerVirusMultiChipTestCaseL10 Test—supercomputing-swharness 2026.226
TH-VBB-0001-S4Q9390660097v10.3Ulysses KaoBASEBOARD_INVENTORY_QUERY_FAILEDBaseboard/VBB inventory or version information could not be queried.S4 TRIAGEQ9 ESCALATEFix the station, image, or suite configuration; do NOT route the unit to rework.SoftwareL10.VBB.BASEBOARDCheckBaseboard
CheckBaseboardVersion
L10 Test—supercomputing-swharness 2026.226
TH-VBB-0002-S2Q9455671810v10.3Ulysses KaoBASEBOARD_IDENTITY_MISMATCHBaseboard manufacturer, product, serial, or board identity does not match the expected BOM.S2 ISOLATEQ9 ESCALATECapture logs and isolate the unit; do not continue the L10 suite on this code. Attach the per-test log and suite URL; route to FA; open Jira.DataL10.VBB.BASEBOARDCheckBaseboardL10 Test—supercomputing-swharness 2026.226
TH-VBB-0003-S5Q9358154243v10.3Ulysses KaoBASEBOARD_VERSION_MISMATCHThe baseboard/VBB hardware or firmware version does not match the expected release.S5 CONFIGQ9 ESCALATECapture logs and isolate the unit; do not continue the L10 suite on this code. Attach the per-test log and suite URL; route to FA; open Jira.ConfigL10.VBB.BASEBOARDCheckBaseboardVersionL10 Test—supercomputing-swharness 2026.226
TH-VBB-0004-S5Q9358154244v10.3Ulysses KaoBASEBOARD_EXPECTED_CONFIG_UNAVAILABLEExpected baseboard/VBB BOM or version data could not be loaded; no DUT verdict is available.S5 CONFIGQ9 ESCALATEFix the station, image, or suite configuration; do NOT route the unit to rework.ConfigL10.VBB.BASEBOARDCheckBaseboard
CheckBaseboardVersion
L10 Test—supercomputing-swharness 2026.226

Common codes

Cross-station codes from common_th_registry.yaml. 19 codes.

Error Code IDPackedVerDoc RevOriginal AuthorNameMessageSeverityQuick ActionRecover / Troubleshooting ProcedureError TypeComponentTest CaseSourceBugsOwnerSince
TH-C2C-0010-S4Q9390660106v10.4Ulysses KaoC2C_CONFIG_REQUEST_FAILEDFirmware rejected the Ethernet configuration request or the configuration helper received a non-OK firmware status. No FLR is attempted; earlier chips may already have stored the override.S4 TRIAGEQ9 ESCALATEInspect the firmware status and host/firmware compatibility; common-reset the tray before retrying to clear partially stored overrides.SoftwareC2C.SOHU_SERDESC2cConfigureMultiChipTestCaseCommon—supercomputing-swunreleased
TH-C2C-0011-S4Q9390660107v10.4Ulysses KaoC2C_CONFIG_FLR_FAILEDAll Ethernet override requests were stored, but the FLR helper returned an error while applying them. FEC readback was not attempted, so the requested configuration is unverified and this code alone does not diagnose hardware.S4 TRIAGEQ9 ESCALATEInspect the FLR error, proxy health, and firmware recovery; common-reset the tray before rerunning configuration and link validation.SoftwareC2C.SOHU_SERDESC2cConfigureMultiChipTestCaseCommon—supercomputing-swunreleased
TH-C2C-0012-S4Q9357105676v10.4Ulysses KaoC2C_CONFIG_READBACK_MISMATCHAfter storing the override and completing FLR, one or more datalink pairs reported an unset FEC mode or a mode different from the requested value. All readback mismatches are included in the test message. This proves a configuration mismatch, not a link-quality or hardware failure.S4 TRIAGEQ9 ESCALATECompare expected and actual modes, inspect firmware configuration application and competing resets, then rerun configuration and link validation.ConfigC2C.SOHU_SERDESC2cConfigureMultiChipTestCaseCommon—supercomputing-swunreleased
TH-ENV-0001-S4Q9289996801v10.2Ulysses KaoHOST_NOT_REACHABLE_AFTER_BOOTThe station host or its BMC did not answer ping or SSH after boot, so no module test could start. This is a test-system condition, not a module verdict.S4 TRIAGEQ9 ESCALATEConnect a monitor to the Devkit and verify that the system boots successfully, then try ping with host / BMC. Collect the suite/test logs and artifacts for this failure. Escalate to Etched engineer with the collected logs.Network1X.ENV.STATION_HOST—1X Module Test—supercomputing-swharness 2026.216
TH-ENV-0002-S4Q9357105666v10.2Aidan HolmSTATION_FIXTURE_SETUP_CHECK_FAILEDStation fixture/setup check failed (Chroma telemetry / eval board power / vfio-proxy version query or mismatch / PEX version).S4 TRIAGEQ9 ESCALATECollect the suite/test logs and artifacts for this failure. Escalate to Etched engineer with the collected logs. DO NOT retest.Config1X.ENV.STATION_FIXTUREChromaTelemetryCheckTestCase
EvalBoardPowerTestCase
VfioProxyVersionTestCase
CheckPexFirmwareVersionTestCase
1X Module Test—supercomputing-swharness 2026.216
TH-ENV-0003-S4Q9357105667v10.2Mykola ServetnykPLX_DAEMON_NO_PEX_SWITCHESPLX daemon reported no PEX switches.S4 TRIAGEQ9 ESCALATECollect the suite/test logs and artifacts for this failure. Escalate to Etched engineer with the collected logs. DO NOT retest.Config1X.ENV.PEX_SWITCHCheckPexFirmwareVersionTestCase1X Module TestETCH-35552: CheckPexFirmwareVersionTestCase failuresupercomputing-swharness 2026.216
TH-ENV-0004-S4Q9357105668v10.2Aidan HolmHOST_SETUP_STEP_FAILEDA host driver/setup utility step failed: a kernel module reload, PCIe teardown or bus rescan, Kayak RAID remount, sohu_mdev sysfs parameter write, or log-reader activation returned non-zero on the station host.S4 TRIAGEQ9 ESCALATECollect the suite/test logs and artifacts for this failure. Escalate to Etched engineer with the collected logs. DO NOT retest.Config1X.ENV.HOST_SETUPReloadKernelModuleTestCase
PcieTeardownTestCase
PcieRescanTestCase
SetSkipFlrOnOpenCloseTestCase
SohuLogReaderActivateTestCase
LogReaderCaptureTestCase
PublishBootloaderTypeTestCase
KayakRaidRemountTestCase
1X Module Test0supercomputing-swharness 2026.216
TH-HAR-0001-S4Q0390070273v10.3Ulysses KaoTEST_TIMEOUTA test case exceeded its configured timeout and was terminated by the harness before producing a verdict.S4 TRIAGEQ0 NO_ACTRerun the affected subset once to check reproducibility. Route to engineering triage with the per-test log and timeout configuration.CATEGORY_SOFTWAREL10.HAR.HARNESS—L10 Test—supercomputing-swharness 2026.216
TH-HAR-0002-S5Q9358154242v10.2Ulysses KaoTEST_ARGS_INVALIDA test case was invoked with invalid or unsupported arguments (e.g. unexpected kwargs, unsupported mode) and rejected the run before touching the DUT.S5 CONFIGQ9 ESCALATEFix the suite YAML for this test; do not route the unit to reworkConfigL10.HAR.HARNESSSohuSecureBootRecoveryUpdateTestCase
ServerNestedTestCase
SohuSnapTestCase
VfioProxyVersionTestCase
SohuWeightLoadTestCase
SltModuleNestedTestCase
1X Module Test—supercomputing-swharness 2026.216
TH-HAR-0003-S5Q9358154243v10.2Ulysses KaoTEST_DEPENDENCY_UNAVAILABLEA tool, binary, or data file the test depends on (e.g. the pldm_ua binary) is missing on the test system, so the test could not perform its function. Distinct from TH-CPU-0003, which covers a tool missing on the DUT. Also covers missing VBB flash runfiles / nm toolchain / version_info artifacts for fixture firmware update and chipsim /mnt/weights 9p mount failure for Kayak workloads that never start.S5 CONFIGQ9 ESCALATEFix the station deployment / harness package; do not route the unit to reworkConfigL10.HAR.HARNESSSohuSecureBootRecoveryUpdateTestCase
SohuWeightLoadTestCase
VbbFirmwareUpdateTestCase
1X Module Test—supercomputing-swharness 2026.216
TH-HAR-0004-S4Q9357105668v10.2Ulysses KaoNESTED_SUITE_ORCHESTRATION_FAILEDA nested suite failed to launch or complete orchestration (container image load, API ready/config, abort/shutdown, missing kv_store inputs, or resource wiring). Child test failures carry their own codes; the wrapper never mints this code for an inner suite that ran and failed. Unpopulated chip slots on SltModuleNestedTestCase remain SKIP (not this code).S4 TRIAGEQ9 ESCALATECheck suite config/resources; wrapper must propagate the first/most-severe child error code - never mint duplicate codes for child failures (test-system ERROR - excluded from yield)Config1X.HAR.NESTED_SUITEServerNestedTestCase
SltModuleNestedTestCase
1X Module Test—supercomputing-swharness 2026.216
TH-HAR-0005-S4Q6390463493v10.3Ulysses KaoTEST_TOOL_EXECUTION_FAILEDA test-owned command or binary failed to execute and did not produce a domain-specific DUT verdict.S4 TRIAGEQ6 RETRYFix the station, image, or suite configuration; do NOT route the unit to rework.SoftwareL10.HAR.HARNESSIoStress
ExecBinaryTestCase
CpldDiagnosticsRemoteTestCase
L10 Test—supercomputing-swharness 2026.226
TH-HAR-0006-S4Q9390660102v10.3Ulysses KaoTEST_METRICS_PARSE_FAILEDA test tool completed without complete, parseable metrics needed to determine the result.S4 TRIAGEQ9 ESCALATEFix the station, image, or suite configuration; do NOT route the unit to rework.SoftwareL10.HAR.HARNESSIoStress
ExecBinaryTestCase
L10 Test—supercomputing-swharness 2026.226
TH-HAR-0007-S4Q9390660103v10.3Ulysses KaoTEST_OUTPUT_UNAVAILABLEExpected test output, state, or result artifacts were not produced.S4 TRIAGEQ9 ESCALATEFix the station, image, or suite configuration; do NOT route the unit to rework.SoftwareL10.HAR.HARNESSStoreSystemLogStates
CheckSystemLogStates
ExecBinaryTestCase
L10 Test—supercomputing-swharness 2026.226
TH-HAR-0008-S5Q9358154248v10.3Ulysses KaoTEST_PRECONDITION_NOT_META required test precondition was not satisfied, so the test did not exercise the DUT as intended.S5 CONFIGQ9 ESCALATEFix the station, image, or suite configuration; do NOT route the unit to rework.ConfigL10.HAR.HARNESSRunInStress
IoStress
NetworkBwRdmaTest
L10 Test—supercomputing-swharness 2026.226
TH-HAR-0009-S4Q9390660105v10.3Ulysses KaoTEST_CLEANUP_FAILEDTest cleanup failed and may have left processes, mounts, namespaces, files, or device state behind.S4 TRIAGEQ9 ESCALATEFix the station, image, or suite configuration; do NOT route the unit to rework.SoftwareL10.HAR.HARNESSLoopbackTopologyTest
NetworkBwRdmaTest
FreeModelRegistryFromShmTestCase
FreeWeightsTestCase
L10 Test—supercomputing-swharness 2026.226
TH-HAR-9998-S3Q0271591182v10.3Ulysses KaoTEST_FAILED_UNCLASSIFIEDCatch-all - a test case failed (raised TestFailedError) without carrying a specific TH error code. Frequent sources should be migrated to dedicated codes (spec §9 taxonomy-health metric).S3 UNKNOWNQ0 NO_ACTFollow the failing test case's own documentation/SOP. Open a taxonomy-gap ticket to allocate a specific code for this failure mode.CATEGORY_NONEL10.HAR.HARNESS—L10 Test—supercomputing-swharness 2026.216
TH-HAR-9999-S3Q9389621519v10.3Ulysses KaoUNHANDLED_EXCEPTIONUnhandled exception during test execution, wrapped by the harness (spec §11.2.2). The traceback is preserved in the per-test log.S3 UNKNOWNQ9 ESCALATECollect the suite/test logs and artifacts for this failure. Escalate to Etched engineer with the collected logs and traceback; do NOT route the unit to rework or FA.CATEGORY_SOFTWAREL10.HAR.HARNESS—L10 Test—supercomputing-swharness 2026.216
TH-PWR-0001-S4Q2373424129v10.2Mykola ServetnykSTATION_PSU_LOAD_IMBALANCEStation PSU load imbalance above 5% or PGOOD failure (fixture problem; excluded from module yield).S4 TRIAGEQ2 WARM_REBOOTKnown Devkit intermittent issue, retest once.Hardware1X.PWR.STATION_PSUCheckPsuHealth1X Module Test—supercomputing-swharness 2026.216

L11 Test codes

61 codes.

Error Code IDVerDoc RevOriginal AuthorNameMessageSeverityQuick ActionRecover / Troubleshooting ProcedureError TypeComponentTest CaseSourcePossible Root CauseBugsOwnerSince
EC-16060a0a003f sheet onlyv10.3Ulysses Kao—ToR redundancy failed (aggregate)—UndefinedSee enumerated sub-failuresFunctionToR SwitchTorSwitchRedundancyTestCaseL11 Test————
EC-16060b0b003a sheet onlyv10.3Ulysses Kao—Mgmt switch redundancy failed (aggregate)—UndefinedSee enumerated sub-failuresFunctionMgmt switchMgmtSwitchRedundancyTestCaseL11 Test————
EC-160401000009 sheet onlyv10.3Ulysses Kao—Resource not SSH—UndefinedFix resource configInitialUndefinedPingAllP2pPairsTestCaseL11 Test————
EC-16040106000d sheet onlyv10.3Ulysses Kao—Primary RMS provision: no ssh_target—UndefinedSet ssh_target in suiteInitialRMSProvisionPrimaryRmsL11 Test————
EC-160401060015 sheet onlyv10.3Ulysses Kao—Provision CDU/PDU/compute/RMS2: no ssh—UndefinedSet ssh_targetInitialRMSProvisionCdu
ProvisionPdu
ProvisionComputeServer
ProvisionRedundantRms
L11 Test————
EC-16040106001f sheet onlyv10.3Ulysses Kao—CDU/PDU health: no ssh_target—UndefinedSet suite ssh_targetInitialRMSCduHealthCheckTestCase
PduHealthCheckTestCase
L11 Test————
EC-160401070030 sheet onlyv10.3Ulysses Kao—BMC power-cycle wrapper: no ssh_target—UndefinedPoint ssh at RMSInitialBMCSohuServerBmcPowerCycleL11 Test————
EC-160401070033 sheet onlyv10.3Ulysses Kao—Firmware check: no ssh_target—UndefinedPoint ssh at RMSInitialBMCSohuServerFirmwareInventoryCheckL11 Test————
EC-160402000001 sheet onlyv10.3Ulysses Kao—Runner date failed—UndefinedFix runner shell / harnessConnectionUndefinedCheckSystemClockTestCaseL11 Test————
EC-16040200000a sheet onlyv10.3Ulysses Kao—SSH resource missing—UndefinedFix keys / inventoryConnectionUndefinedPingAllP2pPairsTestCaseL11 Test————
EC-16040200000b sheet onlyv10.3Ulysses Kao—SSH resource open error—UndefinedUndefined connection / fix RMConnectionUndefinedPingAllP2pPairsTestCaseL11 Test————
EC-16040200000c sheet onlyv10.3Ulysses Kao—Ping mesh failure—UndefinedFix L3 / bonds / switchesConnectionUndefinedPingAllP2pPairsTestCaseL11 Test————
EC-160402020032 sheet onlyv10.3Ulysses Kao—Host SSH not up after power-on—UndefinedOS / network / sshdConnectionCPUSohuServerBmcPowerCycleL11 Test————
EC-160402040019 sheet onlyv10.3Ulysses Kao—PDU unreachable (ping)—UndefinedPDU network / powerConnectionPDUProvisionPduL11 Test————
EC-160402050018 sheet onlyv10.3Ulysses Kao—CDU unreachable (ping)—UndefinedCDU network / powerConnectionCDUProvisionCduL11 Test————
EC-160402060003 sheet onlyv10.3Ulysses Kao—RMS date over SSH failed—UndefinedCheck RMS SSH / routingConnectionRMSCheckSystemClockTestCaseL11 Test————
EC-160402060013 sheet onlyv10.3Ulysses Kao—MTS apt proxy unreachable locally—UndefinedStart / fix apt proxyConnectionRMSProvisionPrimaryRmsL11 Test————
EC-160402060014 sheet onlyv10.3Ulysses Kao—RMS cannot reach apt proxy—UndefinedRouting / firewall to proxyConnectionRMSProvisionPrimaryRmsL11 Test————
EC-1604020a002a sheet onlyv10.3Ulysses Kao—Switch eAPI curl failed—UndefinedFix switch mgmt / credsConnectionToR SwitchSwitchInventoryCheckTestCase
MgmtSwitchRedundancyTestCase
L11 Test————
EC-16040302001d sheet onlyv10.3Ulysses Kao—Compute server provisioning failed—UndefinedRC provision logsProvisionCPUProvisionComputeServerL11 Test————
EC-160403060010 sheet onlyv10.3Ulysses Kao—Ansible playbook failed—UndefinedRead ansible artifacts / logsProvisionRMSProvisionPrimaryRmsL11 Test————
EC-160403060011 sheet onlyv10.3Ulysses Kao—Image import to RMS failed—UndefinedCheck microk8s / disk on RMSProvisionRMSProvisionPrimaryRmsL11 Test————
EC-160403060012 sheet onlyv10.3Ulysses Kao—Cleanup of images failed—UndefinedSSH / permissions on RMSProvisionRMSProvisionPrimaryRmsL11 Test————
EC-16040306001a sheet onlyv10.3Ulysses Kao—Rack-controller provisioning task failed—UndefinedRC logs / rack controllerProvisionRMSProvisionCdu
ProvisionPdu
ProvisionRedundantRms
L11 Test————
EC-1604030b0006 sheet onlyv10.3Ulysses Kao—ZTP container start failed—UndefinedCheck ZTP service on RMSProvisionMgmt switchSwitchZtpTriggerTestCaseL11 Test————
EC-1604030b0007 sheet onlyv10.3Ulysses Kao—ZTP container stop failed—UndefinedInspect ZTP logs / daemonProvisionMgmt switchSwitchZtpTriggerTestCaseL11 Test————
EC-160404020035 sheet onlyv10.3Ulysses Kao—Per-server BOM scope: missing server_id—UndefinedPass server_id in suiteConfigCPU_SohuServerScopedBomMixinL11 Test————
EC-160404040023 sheet onlyv10.3Ulysses Kao—PDU resource not PduConnection—UndefinedFix PDU resource entryConfigPDUPduHealthCheckTestCase
PduInventoryCheckTestCase
L11 Test————
EC-16040404002e sheet onlyv10.3Ulysses Kao—No PDU in BOM—UndefinedFix BOMConfigPDUPduInventoryCheckTestCaseL11 Test————
EC-160404040039 sheet onlyv10.3Ulysses Kao—PDU resource invalid for redundancy test—UndefinedFix pdu_target resourceConfigPDUMgmtSwitchRedundancyTestCaseL11 Test————
EC-16040404003e sheet onlyv10.3Ulysses Kao—PDU resource invalid for ToR test—UndefinedFix pdu_target resourceConfigPDUTorSwitchRedundancyTestCaseL11 Test————
EC-160404050017 sheet onlyv10.3Ulysses Kao—CDU interface / entity mismatch—UndefinedFix CDU hostname in registryConfigCDUProvisionCduL11 Test————
EC-160404050022 sheet onlyv10.3Ulysses Kao—CDU resource not CduConnection—UndefinedFix CDU resource entryConfigCDUCduHealthCheckTestCase
CduInventoryCheckTestCase
L11 Test————
EC-16040405002c sheet onlyv10.3Ulysses Kao—No CDU in BOM—UndefinedFix BOMConfigCDUCduInventoryCheckTestCaseL11 Test————
EC-160404060005 sheet onlyv10.3Ulysses Kao—Clock skew over tolerance—UndefinedFix NTP / time syncConfigRMSCheckSystemClockTestCaseL11 Test————
EC-16040406000e sheet onlyv10.3Ulysses Kao—Vault / inputs validation failed—UndefinedFix l11_inputs / vault fileConfigRMSProvisionPrimaryRmsL11 Test————
EC-16040406000f sheet onlyv10.3Ulysses Kao—No provisioning images found—UndefinedRestore deploy image tarballConfigRMSProvisionPrimaryRmsL11 Test————
EC-160404060016 sheet onlyv10.3Ulysses Kao—Unknown rack entity—UndefinedFix rack_entities / IDsConfigRMSProvisionCdu
ProvisionPdu
L11 Test————
EC-16040406001e sheet onlyv10.3Ulysses Kao—Redundant RMS vault/data error—UndefinedFix vault inputsConfigRMSProvisionRedundantRmsL11 Test————
EC-160404060020 sheet onlyv10.3Ulysses Kao—RMS SSH resource wrong type—UndefinedFix resource YAMLConfigRMSCduHealthCheckTestCase
PduHealthCheckTestCase
L11 Test————
EC-160404060021 sheet onlyv10.3Ulysses Kao—Rack controller port missing—UndefinedAdd RC port to resourcesConfigRMSCduHealthCheckTestCase
PduHealthCheckTestCase
L11 Test————
EC-160404060028 sheet onlyv10.3Ulysses Kao—RMS BOM missing—UndefinedFix BOM YAMLConfigRMSRmsInventoryCheckTestCaseL11 Test————
EC-160404060029 sheet onlyv10.3Ulysses Kao—RMS inventory mismatch—UndefinedReplace HW / fix BOMConfigRMSRmsInventoryCheckTestCaseL11 Test————
EC-160404070034 sheet onlyv10.3Ulysses Kao—Firmware version mismatch—UndefinedUpdate BMC/BIOS/PSU FWConfigBMCSohuServerFirmwareInventoryCheckL11 Test————
EC-1604040a002b sheet onlyv10.3Ulysses Kao—Switch BOM mismatch—UndefinedReplace switch / BOMConfigToR SwitchSwitchInventoryCheckTestCaseL11 Test————
EC-1604040a003b sheet onlyv10.3Ulysses Kao—No ToR switches in registry—UndefinedFix registry accessorsConfigToR SwitchTorSwitchRedundancyTestCaseL11 Test————
EC-1604040a003c sheet onlyv10.3Ulysses Kao—ToR switch ID not in registry—UndefinedFix rack_entities.txtpbConfigToR SwitchTorSwitchRedundancyTestCaseL11 Test————
EC-1604040a003d sheet onlyv10.3Ulysses Kao—ToR switch lacks pdu_connections—UndefinedFix PDU outlet mappingConfigToR SwitchTorSwitchRedundancyTestCaseL11 Test————
EC-1604040b0036 sheet onlyv10.3Ulysses Kao—Mgmt switch ID not in registry—UndefinedFix rack_entities.txtpbConfigMgmt switchMgmtSwitchRedundancyTestCaseL11 Test————
EC-1604040b0037 sheet onlyv10.3Ulysses Kao—Mgmt switch lacks pdu_connections—UndefinedFix PDU outlet mappingConfigMgmt switchMgmtSwitchRedundancyTestCaseL11 Test————
EC-1604040b0038 sheet onlyv10.3Ulysses Kao—Cannot resolve mgmt switch peer—UndefinedExpect two mgmt switchesConfigMgmt switchMgmtSwitchRedundancyTestCaseL11 Test————
EC-160406000002 sheet onlyv10.3Ulysses Kao—Runner epoch parse failed—UndefinedFix runner clock outputFunctionUndefinedCheckSystemClockTestCaseL11 Test————
EC-160406000008 sheet onlyv10.3Ulysses Kao—Need ≥2 ping targets—UndefinedFix suite ping_targetsFunctionUndefinedPingAllP2pPairsTestCaseL11 Test————
EC-160406060004 sheet onlyv10.3Ulysses Kao—RMS epoch parse failed—UndefinedFix RMS clock outputFunctionRMSCheckSystemClockTestCaseL11 Test————
EC-16060504001c sheet onlyv10.3Ulysses Kao—PDU post-provision health bad—UndefinedPDU telemetry / RC stateFunctionPDUProvisionPduL11 Test————
EC-160605040025 sheet onlyv10.3Ulysses Kao—PDU health aggregate failure—UndefinedSee per-line daemon logsFunctionPDUPduHealthCheckTestCaseL11 Test————
EC-16060504002f sheet onlyv10.3Ulysses Kao—PDU inventory mismatch—UndefinedFix PDU vs BOMFunctionPDUPduInventoryCheckTestCaseL11 Test————
EC-16060505001b sheet onlyv10.3Ulysses Kao—CDU post-provision health bad—UndefinedCDU telemetry / RC stateFunctionCDUProvisionCduL11 Test————
EC-160605050024 sheet onlyv10.3Ulysses Kao—CDU health aggregate failure—UndefinedSee per-line daemon logsFunctionCDUCduHealthCheckTestCaseL11 Test————
EC-16060505002d sheet onlyv10.3Ulysses Kao—CDU inventory mismatch—UndefinedFix CDU vs BOMFunctionCDUCduInventoryCheckTestCaseL11 Test————
EC-160607070031 sheet onlyv10.3Ulysses Kao—BMC power-cycle sequence failed—UndefinedBMC / bmc-daemon logsFunctionBMCSohuServerBmcPowerCycleL11 Test————

Test case DRI ownership

DRI 1 of a code’s primary test case is what the Original Author column above resolves to; codes with no DRI listed fall back to the spec author (Ulysses Kao). Hover an author cell to see which basis was used.

Test caseDRI 1DRI 2StatusPR
BootloaderResultTestCaseMykola ServetnykUlysses Kaomerged#23002
C2cIntegrityTestCaseMykola ServetnykUlysses Kaomerged#22810
C2cLaneMarginTestCaseMykola ServetnykUlysses Kaomerged#22813
C2cLinkupTestCaseMykola ServetnykUlysses Kaomerged#22808
C2cPrbsLoopbackTestCaseMykola ServetnykUlysses Kaomerged#23117
C2cThroughputTestCaseMykola ServetnykUlysses Kaomerged#22812
CheckFirmwareVersionTestCaseMykola ServetnykUlysses Kao—#24591
CheckPexFirmwareVersionTestCaseMykola ServetnykUlysses Kaomerged#23116
CheckPsuHealthMykola ServetnykUlysses Kaomerged#23963
ChromaTelemetryCheckTestCaseAidan HolmUlysses Kao——
CpldDiagnosticsTestCaseMykola ServetnykUlysses Kao—#24594
DetectBoardDvfsProfileTestCaseMykola ServetnykUlysses Kaomerged#23003
EvalBoardPowerTestCaseAidan HolmJack Chou——
KayakTestCaseAidan HolmJack Chou——
KvFlushAndAttentionInterleavedSingleChipTestCaseAidan HolmJack Chou——
KvFlushAndAttentionSingleChipTestCaseAidan HolmJack Chou——
LogReaderCaptureTestCaseAidan HolmJack Chou——
MezzanineI2cAlertsTestCaseAidan HolmJack Chou——
PcieRescanTestCaseUlysses KaoMykola Servetnyk—#22868
PcieSetupTestCaseAidan HolmJack Chou——
PcieTeardownTestCaseAidan HolmJack Chou——
ProgramSecureBootloaderTestCaseAidan HolmJack Chou——
PublishBootloaderTypeTestCaseAidan HolmJack Chou——
ReloadKernelModuleTestCaseAidan HolmJack Chou——
RetimerFirmwareUpdateTestCaseAidan HolmJack Chou——
RunAllAttnHbmBypassTestsSingleChipTestCaseSam JiangJames ChouIn review#22847
RunAllAttnTestsSingleChipTestCaseSam JiangJames ChouIn review#22838
RunKvFlushTestsSingleChipTestCaseSam JiangJames ChouIn review#22839
SaSortRampupHbmSingleChipTestCaseSam JiangJames ChouIn review#22840
ServerNestedTestCaseUlysses KaoMykola Servetnyk—#22859
SetSkipFlrOnOpenCloseTestCaseSam JiangJames ChouIn review#22846
SltModuleNestedTestCaseUlysses KaoMykola Servetnyk—#22863
SohuBusConnectivityTestCaseSam JiangJames ChouIn review#22841
SohuChipBinTestCaseUlysses KaoMykola Servetnyk—#22865
SohuChipIdTestCaseSam JiangJames ChouIn review#22842
SohuCtsTestCaseSam JiangJames ChouIn review#22843
SohuDmaTestCaseSam JiangJames ChouIn review#22811
SohuDtsTestCaseSam JiangJames ChouIn review#22844
SohuEfuseTestCaseSam JiangJames ChouIn review#22845
SohuFirmwareUpdateTestCaseMykola ServetnykJames Choumerged#22816 #22817
SohuFlrTestCaseJames ChouAidan HolmIn review#22807
SohuGpioTestCaseJames ChouAidan HolmIn review#22801
SohuHbmBandwidthTestCaseJames ChouAidan HolmIn review#22819
SohuHbmDeviceIdTestCaseJames ChouAidan HolmIn review#22805
SohuHotReloadFirmwareUpdateTestCaseJames ChouAidan Holm—#22820
SohuI2cTestCaseJames ChouAidan HolmIn review#22800
SohuJtagTestCaseJames ChouAidan HolmIn review#22802
SohuLaneRepairTestCaseJames ChouAidan Holm—#22806
SohuLlama8bFp8ForwardTestCaseAidan HolmJames Chou——
SohuLlama8bFp8PrefillTestCaseAidan HolmJames Chou——
SohuLlamaMttTestCaseJames ChouAidan Holm—#22827
SohuLogReaderActivateTestCaseJames ChouAidan HolmIn review#22804
SohuMtcStressTestCaseJack ChouSam Jiang—#22899
SohuPcieAerCheckTestCaseJack ChouSam Jiang—#22892
SohuPcieCsramThroughputTestCaseJack ChouSam Jiang—#22890
SohuPcieLaneMarginTestCaseJack ChouSam Jiang—#22889
SohuPcieRateChangeTestCaseJack ChouSam Jiang—#22893
SohuPdTestCaseJack ChouSam Jiang—#22898
SohuPmbistTestCaseJack ChouSam Jiang—#22891
SohuPowerTelemetryTestCaseJack ChouSam Jiang—#22897
SohuPowerVirusTestCaseJack ChouSam Jiang—#22895
SohuPowerVirusThermalTestCaseJack ChouSam Jiang—#22894
SohuRdqsSweepTrainingTestCaseJack ChouSam Jiang—#22888
SohuSaScreeningTestCaseJack ChouSam Jiang—#22896
SohuSauPllPhaseAlignmentTestCaseUlysses KaoMykola Servetnyk—#22803
SohuSecureBootRecoveryUpdateTestCaseUlysses KaoMykola Servetnyk—#22809
SohuSnapTestCaseUlysses KaoMykola Servetnyk—#22866
SohuSramMemoryTestCaseUlysses KaoMykola Servetnyk—#22828
SohuThermalDiodeTestCaseUlysses KaoMykola Servetnyk—#22830
SohuUartTestCaseUlysses KaoMykola Servetnyk—#22851
SohuVfioPingTestCaseUlysses KaoMykola Servetnyk—#22853
SohuVmTestCaseUlysses KaoMykola Servetnyk—#22854
SohuVrmTestCaseUlysses KaoMykola Servetnyk—#22855
SohuWeightLoadTestCaseUlysses KaoMykola Servetnyk—#22856
VbbFirmwareUpdateTestCaseUlysses KaoMykola Servetnyk—#22858
VfioProxyVersionTestCaseUlysses KaoMykola Servetnyk—#22860

Source data notes

Points where the spreadsheet needed a judgment call to normalize.

These Error Code IDs each appear twice in one stage block of the sheet (an older short-form row plus a later expanded row). Identity segments are immutable, so the repeat is the same code: the row with more detail is kept and the other is listed here for reconciliation in the sheet.

Error Code IDStageQuick action keptQuick action droppedDropped row messageDropped row test cases
TH-SOHU-0024-S5Q9MLT / 1X Module TestESCALATEHALT_ESCALATERequired screening data missing or failed to load (SA mask / bin inputs)SohuChipBinTestCase, SohuSaScreeningTestCase, SaSortRampupHbmSingleChipTestCase
TH-SOHU-0026-S2Q9MLT / 1X Module TestESCALATEHALT_ESCALATEPLL glitch frequency did not read back within 5% of target before timeoutSetPllGlitchFreqTestCase
TH-SOHU-0027-S2Q9MLT / 1X Module TestESCALATEHALT_ESCALATEVFIO ping responses received but none within the allowed latency (device pingable, latency out of spec)SohuVfioPingTestCase

Sources & provenance

Aidan Holm, 2026-08-12 in #error-code-define: “The source of truth is going to move to the in-repo error code directory; from there we’re eventually going to want some automated documentation generated from that.” This page is generated by gen.py from that registry plus the spreadsheet — regenerate rather than hand-edit.